{"text_format":"1","workbook":"xlsx","n_sheets":8,"sheets":["Instructions, Start Here","Summary","Data Information","Mapping Information","Template","Developer Notes","LookupTables","Example"],"not_rendered":{"charts":0,"images":1,"macros":1,"external_links":0,"defined_names":21,"comments":2,"pivot_tables":0},"unopened":[],"bounds":{"document_bytes":16777216,"sheet_cells":100000,"rows_first":2000,"rows_last":500,"rows_between":2000,"halvings":0,"cell_chars":16384,"cell_head_chars":4096},"cells_cut":0,"cells_raw":0,"read":"whole","date_system":"1900"}

{"sheet":"Instructions, Start Here","index":0,"n_rows":58,"n_cols":1,"rows_kept":58,"cut":false,"hidden":false,"merged":[]}
[]
["Mental Health/Substance Use Disorder (MHSUD)\nFinancial Requirement Parity Workbook for Plan Year (PY) 2026\nIndividual or Small Group Market Rate Filing"]
["Last Updated: 3/21/2025"]
[]
["Purpose"]
["● Issuers and plans must comply with the federal Mental Health Parity and Addiction Equity Act of 2008 (MHPAEA) and related regulations and guidance such as Chapter 284-43 WAC Subchapter K, Mental Health and Substance Use Disorder. For ease of reference highlighted excerpts of relevant citations are included at the bottom of this page.\n\n● Financial requirements and treatment limitations applicable to mental health/substance use disorder (MHSUD) benefits cannot be more restrictive than those applicable to medical/surgical benefits. This workbook provides a framework to demonstrate compliance with these financial requirements. \n\n● Populate this workbook in addition to the Word document that further certifies parity of Mental Health and Substance Use Disorder Financial Requirements.\n     "]
[]
["'Summary' Worksheet"]
["● Populate only one 'Summary' worksheet for each Excel file. \n   Unless file size limitations dictate otherwise, only create one Excel file per filing.\n   See specific instructions on the 'Summary' worksheet. \n\n● Note that the [GENERATE TESTING TEMPLATES] macro button on the Summary worksheet creates one testing worksheet per plan, using the HIOS Plan ID field for the tab names.\n     "]
[]
["'Data Information' Worksheet"]
["● Populate only one 'Data Information' worksheet for each Excel file. \n   See specific instructions on the 'Data Information' worksheet.\n      "]
[]
["'Mapping Information' Worksheet"]
["● Populate only one 'Mapping Information' worksheet for each Excel file. \n   See specific instructions on the 'Mapping Information' worksheet.\n     "]
[]
["'Template' Worksheet - One worksheet for each plan"]
["● PARITY PASS/FAIL RESULTS, BY BENEFIT CLASSIFICATION"]
["● Results By Benefit Classification:\n   For each benefit classification, make a selection in the second column (labeled column \"B\"). Select \"Yes\" if all cost shares for medical/surgical services in the benefit classification are the same as those for MH/SUD services in the benefit classification; consider cost shares in terms of deductible, copay, coinsurance, and out-of-pocket maximum.\n   Note: The remaining columns will auto-update based on entries here and elsewhere in the file."]
["---- IMPORTANT ----\nTest results will appear in this table after all PART 1 and PART 2 entries are made in the worksheet.\nNo Benefit Classification results should reflect \"Fail\" after all PART 1 and 2 entries have been made.\nIf any result still reflects \"Fail\" after all entries have been made, please revisit PART 1 and 2 entries. Check that information was entered accurately and flows through as expected. If needed, edit the plan's medical/surgical and/or MHSUD service financial requirements to bring the results into compliance."]
["● Testing Options (located to the right of Results by Benefit Classification):\n   ○ Out-of-network Tier?\n        If out-of-network benefits apply, select \"Yes;\" if not, select \"No.\" \n        When \"No,\" you can leave blank the corresponding out-of-network section(s) in the upcoming PARTS 1 and 2.\n    \n   ○ Outpatient Benefit Testing:\n        Indicate whether outpatient parity will be demonstrated \"All Combined\" or with \"Office Visits Separate.\" \n        Select \"All Combined\" to use the single outpatient classification.\n        Select \"Office Visits Separate\" to use the subclassifications described in WAC 284-43-7020(6), \n           namely (i) Office visits (a.k.a. Outpatient - Office visits) and \n           (ii) All other outpatient items and services (a.k.a. Outpatient - all other).\n           Note: If \"Office Visits Separate\" is selected, testing must be performed for both subclassifiations."]
["● PART 1 -- COST SHARES FOR MEDICAL/SURGICAL BENEFITS, BY BENEFIT CLASSIFICATION"]
["For each benefit classification/subclassification that requires testing (see table Results by Benefit Classification):\n   List services and cost shares for covered medical/surgical benefits + other embedded non-MHSUD benefits like pediatric dental. \n   Include every possible financial requirement type and level for each benefit classification/subclassification. \n   Include preventive services and other services with no cost shares. \n"]
["● Service Description:\n  Briefly describe the service. \n  Be consistent with what is in the 'Mapping Information' worksheet in this file, the Form filing, \n     the Plans and Benefits Template (PBT) in the Binder filing, the Benefit Components file, \n     and other information in this rate filing.\n"]
["● Cost-Share Description:\n   Describe the member's cost-shares. \n   Be consistent with what is in the Form filing, the Plans and Benefits Template (PBT) in the Binder filing, \n      the Benefit Components file, and other information in this rate filing.\n   This entry should contain the wording \"Before Deductible\", \"After Deductible\", or \"Before and After Deductible\" to \n      describe when the cost shares apply, similarly to the Benefit Components file.\n   This entry should contain the wording \"Accrues towards deductible\" if the cost share accrues towards the deductible.\n      If the cost share does not accrue towards the deductible, the entry should not contain the word \"Accrues\" at all."]
["● Plan Projected Allowed Amount:\n   Enter a projected \"allowed\" dollar amount for each plan and listed service. \n   Reminder: Dollar amounts should reflect what the plan \"allows,\" before accounting for enrollee cost sharing \n      and should be consistent with projections for the rate filing. The amounts should generally be specific to each plan. \n      [WAC 284-43-7040(1)(c)]\n"]
["● Deductible:\n   Enter the deductible level that applies to each service. If not subject to deductible, enter \"N/A\".\n   Every row in PART 1 should have a deductible value entered of \"N/A\" or greater than $0.  \n   In other words: The deductible should only be blank in extra data rows \n      or if an entire benefit classification section is not used  (e.g., when there are no out-of-network benefits).\n"]
["● Copayment:\n   Enter the copayment level that applies to each service. If not applicable, enter \"N/A\".\n"]
["● Coinsurance:\n   Enter the coinsurance level that applies to each service. If not applicable, enter \"N/A\".\n"]
["● Out-of-Pocket Maximum (OOPM):\n   Enter the OOPM level that applies to each service. If not applicable, enter \"N/A\".\n"]
["● No Cost Share:\n   Leave this column blank unless the member has no cost share for the service. \n   If no cost share applies, enter \"x\" in this column and enter \"N/A\" for Deductible, Copayment, Coinsurance, and OOPM.\n"]
["● PART 2 -- ANALYSIS OF MHSUD FINANCIAL REQUIREMENT PARITY, BY BENEFIT CLASSIFICATION"]
["Note: the remaining columns of the top table will auto-populate after entries are made throughout PARTS 1 and 2.\nFor each benefit classification/subclassification that requires testing (see table Results by Benefit Classification):\n● MHSUD Cost Shares in Plan Design:\n   Indicate the plan design's MHSUD benefit financial requirements for each benefit classification/subclassification.\n   If a particular type of financial requirement does not apply, enter \"N/A\".\n"]
["● Step 1 Substantially All:\n   This table will auto-populate from PARTS 1 and 2.\n   Confirm details appear as expected. If not, revisit information entered elsewhere in PARTS 1 and 2.\n"]
["● Step 2 Predominant Level:\n   For each financial type that passed the Step 1 Substantially All test:\n      Inputs are required in each section. \n      Enter every unique amount (a.k.a. level), from smallest to largest, separately by financial requirement type \n         (i.e., deductible, copayment, coinsurance, and OOPM). \n      If a particular type of financial requirement does not apply, simply leave blank those value fields.\n"]
["If you need room to enter additional unique amounts for a particular type of financial requirement, you can insert rows. \n   For example, to enter an additional deductible amount, insert a row above the \"Total\" row in the deductible table; \n   to do so, click in the bottom-right white cell of the deductible section and click [Tab]."]
["The remaining fields will auto-populate using other information from PARTS 1 and 2. \nConfirm details flow through as expected. If not, revisit information entered elsewhere in PARTS 1 and 2.\n"]
[]
["Sample of Relevant Requirements, Citations, and Definitions"]
["1. Mental Health Parity and Addiction Equity Act of 2008 (MHPAEA)\nand Chapter 284-43 WAC Subchapter K, Mental Health and Substance Use Disorder: \nFinancial requirements applicable to mental health/substance use disorder (MHSUD) benefits cannot be more restrictive than those applicable to medical/surgical benefits."]
["2. Financial requirements:\n[WAC 284-43-7010] Financial requirements are cost sharing measures such as deductibles, copayments, coinsurance, and out-of-pocket maximums but do not include aggregate lifetime or annual dollar limits."]
["3. See WAC 284-43-7010 for descriptions of \"Medical/surgical benefits,\" \"Mental health benefits,\" and \"Substance use disorder benefits.\""]
["4. Substantially all:\n[WAC 284-43-7010] A type of financial requirement or quantitative treatment limitation is considered to apply to substantially all medical/surgical benefits in a classification of benefits if it applies to at least two-thirds of all medical/surgical benefits in that classification as determined by WAC 284-43-7040(2)(a)."]
["5. Predominant level:\n[WAC 284-43-7010] If a type of financial requirement or quantitative treatment limitation applies to substantially all medical/surgical benefits in a classification, the predominant level is the level that applies to more than one-half of the medical/surgical benefits in that classification subject to the financial requirement or quantitative treatment limitation."]
["6. Data used in the calculations:\n[WAC 284-43-7040(1)(c)] The determination of the portion of medical/surgical benefits in a classification of benefits subject to a financial requirement or quantitative treatment limitation (or subject to any level of a financial requirement or quantitative treatment limitation) is based on the dollar amount of all plan payments for medical/surgical benefits in the classification expected to be paid under the plan for the plan year. \nSee WAC 284-43-7040(1)(c) (i) and (ii) for additional details."]
["7. Classification of Benefits [WAC 284-43-7020]:"]
["a) Inpatient, in-network:"]
["Benefits furnished on an inpatient basis and within a network of providers established or recognized under a plan or health insurance coverage."]
["b) Inpatient, out-of-network:"]
["Benefits furnished on an inpatient basis and outside any network of providers established or recognized under a plan or health insurance coverage; also includes inpatient benefits under a plan (or health insurance coverage) that has no network of providers."]
["c) Outpatient, in-network:"]
["Benefits furnished on an outpatient basis and within a network of providers established or recognized under a plan or health insurance coverage. \nNote: outpatient can optionally be subclassified into \"Office Visits\" and \"All Other Outpatient Items and Services.\""]
["d) Outpatient, out-of-network:"]
["Benefits furnished on an outpatient basis and outside any network of providers established or recognized under a plan or health insurance coverage; also includes outpatient benefits under a plan (or health insurance coverage) that has no network of providers. \nNote: outpatient can optionally be subclassified into \"Office Visits\" and \"All Other Outpatient Items and Services.\""]
["e) Emergency care:"]
["Benefits for treatment of an emergency condition related to a mental health or substance use disorder. \nSuch benefits must comply with the requirements for emergency medical services in RCW 48.43.093. \nMedically necessary detoxification must be covered as an emergency medical condition according to RCW 48.43.093, and may be provided in hospitals licensed under chapter 70.41 RCW. Medically necessary detoxification services must not require prenotification."]
["f) Prescription drugs: "]
["Benefits for prescription drugs."]

{"sheet":"Summary","index":1,"n_rows":31,"n_cols":5,"rows_kept":31,"cut":false,"hidden":false,"merged":[[23,1,23,4],[16,2,16,4],[12,1,12,4],[13,1,13,4],[14,1,14,4],[18,1,18,4],[22,1,22,4]]}
["MHSUD Financial Requirement Parity Testing -- Summary"]
[]
["Issuer and Filing Information"]
[]
[null,"Issuer Name:","<<Enter Issuer Name>>"]
[null,"HIOS Issuer ID:","<<Enter HIOS Issuer ID #####>>"]
[null,"Market:","Select Market"]
[null,"Plan Year:",2026]
[null,"State Filing Tracking Number:","<<Enter State Tracking ######>>"]
[]
["Worksheet Instructions"]
[]
[null,"Step 1) In your Excel application, ensure macros are enabled and calculations are set to automatic."]
[null,"Step 2) Enter Plans.\n     ● List HIOS Plan IDs and Plan Names in the first two columns of the table below. Include silver base and CSR plan variants. \n     ● When a plan has multiple in-network tiers, load information for each tier. Enter each in-network tier here in this file as a separate \"plan\" record with the plan ID formatted as \"12345WA0010001_INN-T1.\" This will create a separate worksheet for each in-network tier and allows for parity to be analyzed for each tier.\n     ● Confirm all HIOS Plan IDs are included in the table-object and then remove any extra rows in the table. \n     ● For ease of review, we request that plans in this file be in the same order as they are in the Benefit Components' file."]
[null,"Step 3) Click the button below to start the macro that generates the testing worksheets."]
[]
[null,null,"Note: The macro creates a testing template for each Plan ID listed in the table below. It also links the IDs in the table to its worksheet."]
[]
[null,"Step 4) Populate each testing worksheet with the corresponding plan's information."]
[]
[null,null,"This format is used for cells that need user input"]
[]
[null,"Step 5) Prior to submitting this file as part of the rate filing, remove the \"Example\" sheet from the workbook."]
[null,"Step 6) After completing all plan testing worksheets, save a copy of the workbook in Excel and PDF formats and include both as part of your rate filing submission."]
[]
["Testing Summary"]
[]
[null,"HIOS Plan ID","Plan Name","Test Results","Notes"]
[null,"12345WA0010001_INN-T1","Plan 1",{"$f":"IFERROR(INDIRECT(\"'\"&tbl_Summary[[#This Row],[HIOS Plan ID]]&\"'!TestResult\"),\"Enter Plan ID in column 1\")","v":"Enter Plan ID in column 1"}]
[null,"<<Enter HIOS Plan ID>>","<<Enter Plan Name>>",{"$f":"IFERROR(INDIRECT(\"'\"&tbl_Summary[[#This Row],[HIOS Plan ID]]&\"'!TestResult\"),\"Enter Plan ID in column 1\")","v":"Enter Plan ID in column 1"}]
[null,"<<Enter HIOS Plan ID>>","<<Enter Plan Name>>",{"$f":"IFERROR(INDIRECT(\"'\"&tbl_Summary[[#This Row],[HIOS Plan ID]]&\"'!TestResult\"),\"Enter Plan ID in column 1\")","v":"Enter Plan ID in column 1"}]

{"sheet":"Data Information","index":2,"n_rows":19,"n_cols":2,"rows_kept":19,"cut":false,"hidden":false,"merged":[]}
["MHSUD Financial Requirement Parity Testing"]
["Testing Data Information"]
[]
["Instructions: Provide information about the data used to test parity."]
["Item #","Task"]
[1,"Identify the data source used to estimate allowed claims for the purpose of MHSUD financial requirement parity testing. This refers to the allowed amounts by service entered in Part 1 of each plan's testing worksheet."]
[null,"<<Enter your response here; you may add rows as needed to address this item>>"]
[]
[2,"Identify the period (i.e., date range) represented in the data."]
[null,"<<Enter your response here; you may add rows as needed to address this item>>"]
[]
[3,"Address the credibility of the data used in your MHSUD financial requirement parity testing."]
[null,"<<Enter your response here; you may add rows as needed to address this item>>"]
[]
[4,"Identify whether the data is consistent with the data in your URRT.\nIf not, explain why the data is not consistent, why the data is appropriate, and summarize material adjustments made to the data."]
[null,"<<Enter your response here; you may add rows as needed to address this item>>"]
[]
[5,"If data other than State of Washington plan data was used, what is the source, and why is it appropriate for MHSUD financial requirement parity testing purposes?"]
[null,"<<Enter your response here; you may add rows as needed to address this item>>"]

{"sheet":"Mapping Information","index":3,"n_rows":23,"n_cols":4,"rows_kept":23,"cut":false,"hidden":false,"merged":[[9,0,9,3],[5,0,5,3],[4,0,4,3],[6,0,6,3],[7,0,7,3],[8,0,8,3]]}
["MHSUD Financial Requirement Parity Testing "]
["Mapping Medical/Surgical Services to Benefit Classifications"]
[]
["Instructions"]
["Purpose:  Show how medical/surgical services map to benefit classifications used in PART 1 of the testing worksheets."]
[]
["A. Service Description column:\n      List all services used to test parity. If additional rows are needed, add rows to the table. \n      Enter descriptions exactly as they are entered in PART 1 of the testing worksheets.\n"]
["B. Mapped Benefit Classification for MHSUD Parity Testing column:\n      Select the parity testing benefit classification assigned to each medical/surgical service:\n            Inpatient,  Outpatient - Office Visits*,  Outpatient - All Other*,  Emergency Care, or  Prescription Drugs. \n      *Note 1: If ALL plans test parity with the combined Outpatient classification, \n            you may enter \"Outpatient\" instead of \"Outpatient - Office Visits\" and \"Outpatient - All Other\".\n      *Note 2: If ANY plan tests parity using Outpatient subclassifications, \n            choose either \"Outpatient - Office Visits\" or \"Outpatient - All Other\" for each outpatient medical/surgical service."]
["C. Mapped Benefit in corresponding Benefit Components document (If applicable) column:\n     Select the benefit from the Benefit Components document that is assigned to each Benefit Classification for MHSUD parity testing.\n          *Note 1: Click on the \"Import Benefit Components Into Column C\" button and select the matching benefit components to expand the list of options in column C.\n          *Note 2: To assign multiple benefits from the Benefit Components document to a single Benefit Classification for MHSUD parity testing, create two separate rows with the same entry\n          in column B, but different entries in column C."]
["Notes column:  Explain any differences by plan."]
[]
["Mapping Table"]
["A. Service Description","B. Mapped Benefit Classification for MHSUD Parity Testing","C. Mapped Benefit in corresponding Benefit Components document (If applicable)","Notes"]
["<<Enter service description>>","<<select testing classification>>","<<select mapped Ben. Comp. category>>"]
["<<Enter service description>>","<<select testing classification>>","<<select mapped Ben. Comp. category>>"]
["<<Enter service description>>","<<select testing classification>>","<<select mapped Ben. Comp. category>>"]
["<<Enter service description>>","<<select testing classification>>","<<select mapped Ben. Comp. category>>"]
["<<Enter service description>>","<<select testing classification>>","<<select mapped Ben. Comp. category>>"]
["<<Enter service description>>","<<select testing classification>>","<<select mapped Ben. Comp. category>>"]
["<<Enter service description>>","<<select testing classification>>","<<select mapped Ben. Comp. category>>"]
["<<Enter service description>>","<<select testing classification>>","<<select mapped Ben. Comp. category>>"]
["<<Enter service description>>","<<select testing classification>>","<<select mapped Ben. Comp. category>>"]
["<<Enter service description>>","<<select testing classification>>","<<select mapped Ben. Comp. category>>"]

{"sheet":"Template","index":4,"n_rows":116,"n_cols":99,"rows_kept":116,"cut":false,"hidden":false,"merged":[[107,91,109,95],[85,28,87,32],[85,37,87,41],[85,46,87,50],[107,73,109,77],[107,82,109,86],[96,73,98,77],[107,55,109,59],[107,64,109,68],[85,55,87,59],[85,64,87,68],[85,91,87,95],[60,96,60,98],[61,96,64,98],[76,91,78,95],[96,91,98,95],[60,69,60,71],[61,69,64,71],[85,73,87,77],[85,82,87,86],[96,82,98,86],[60,78,60,80],[61,78,64,80],[76,73,78,77],[61,87,64,89],[60,87,60,89],[76,82,78,86],[76,64,78,68],[96,64,98,68],[60,60,60,62],[61,60,64,62],[76,55,78,59],[96,55,98,59],[76,46,78,50],[60,51,60,53],[61,51,64,53],[96,46,98,50],[107,46,109,50],[76,28,78,32],[96,28,98,32],[107,28,109,32],[76,37,78,41],[96,37,98,41],[107,37,109,41],[96,10,98,14],[107,10,109,14],[60,24,60,26],[61,24,64,26],[76,19,78,23],[96,19,98,23],[107,19,109,23],[60,15,60,17],[61,15,64,17],[76,10,78,14],[85,10,87,14],[85,19,87,23],[18,1,19,1],[18,2,19,2],[25,4,26,4],[25,5,26,5],[25,1,26,1],[25,2,26,2],[25,3,26,3],[60,42,60,44],[61,42,64,44],[25,8,26,8],[13,4,13,8],[18,4,19,4],[60,33,60,35],[61,33,64,35],[13,10,13,14],[13,19,13,23],[13,28,13,32],[13,37,13,41],[18,6,19,6],[13,91,13,95],[13,46,13,50],[13,55,13,59],[13,64,13,68],[13,73,13,77],[13,82,13,86]]}
["MHSUD Financial Requirement (a.k.a. Cost Share) Parity Testing",null,null,null,null,null,"Workbook Info",null,null,null,{"$f":"K40","v":"Benefit Classification"},{"$f":"L40","v":"(1) Inpatient, In-Network (IP INN)"},null,null,null,null,null,null,null,{"$f":"T40","v":"Benefit Classification"},{"$f":"U40","v":"(2) Inpatient, Out-of-Network (IP OON)"},null,null,null,null,null,null,null,{"$f":"AC40","v":"Benefit Classification"},{"$f":"AD40","v":"(3) Outpatient, In-Network (OP INN)"},null,null,null,null,null,null,null,{"$f":"AL40","v":"Benefit Classification"},{"$f":"AM40","v":"(3a) Outpatient - Office Visits, In-Network (OP-OV INN)"},null,null,null,null,null,null,null,{"$f":"AU40","v":"Benefit Classification"},{"$f":"AV40","v":"(3b) Outpatient - All Other, In-Network (OP-AO INN)"},null,null,null,null,null,null,null,{"$f":"BD40","v":"Benefit Classification"},{"$f":"BE40","v":"(4) Outpatient, Out-of-Network (OP OON)"},null,null,null,null,null,null,null,{"$f":"BM40","v":"Benefit Classification"},{"$f":"BN40","v":"(4a) Outpatient - Office Visits, Out-of-Network (OP-OV OON)"},null,null,null,null,null,null,null,{"$f":"BV40","v":"Benefit Classification"},{"$f":"BW40","v":"(4b) Outpatient - All Other, Out-of-Network (OP-AO OON)"},null,null,null,null,null,null,null,{"$f":"CE40","v":"Benefit Classification"},{"$f":"CF40","v":"(5) Emergency Care,  (ER )"},null,null,null,null,null,null,null,{"$f":"CN40","v":"Benefit Classification"},{"$f":"CO40","v":"(6) Prescription Drugs,  (RX )"}]
[]
[null,"Issuer / Market:",{"$f":"IF(LEFT(IssuerName,2)=\"<<\",\"<<Go back to 'Summary' tab and enter Issuer Name>>\",IssuerName)","v":"<<Go back to 'Summary' tab and enter Issuer Name>>"},null,null,null,"Link back to Summary Sheet"]
[null,"Market:",{"$f":"IF(Market=\"Select Market\",\"<<Go back to 'Summary' tab and select the market for this filing>>\",Market)","v":"<<Go back to 'Summary' tab and select the market for this filing>>"},null,null,null,"User Inputs Cell Format"]
[null,"State Filing Tracking Number:",{"$f":"IF(LEFT(StateTracker,2)=\"<<\",\"<<Go back to 'Summary' tab and enter state filing tracking number>>\",StateTracker)","v":"<<Go back to 'Summary' tab and enter state filing tracking number>>"},null,null,null,"See the Example worksheet for additional details."]
[]
["PLAN INFORMATION"]
[]
[null,"Plan Name:",null,"<<<<This will auto populate from summary sheet macro"]
[null,"Plan ID:",null,"<<<<This will auto populate from summary sheet macro"]
[null,"CSR Variant Description:",null,"<<<<If the plan is a CSR variant, identify it here. Otherwise, leave the field blank.",null,null,null,null,null,null,"Click>>>>>","Home",null,"Errors found:",{"$f":"O76+O85+O96+O107","v":0},null,null,null,null,"Click>>>>>","Home",null,"Errors found:",{"$f":"X76+X85+X96+X107","v":0},null,null,null,null,"Click>>>>>","Home",null,"Errors found:",{"$f":"AG76+AG85+AG96+AG107","v":0},null,null,null,null,"Click>>>>>","Home",null,"Errors found:",{"$f":"AP76+AP85+AP96+AP107","v":0},null,null,null,null,"Click>>>>>","Home",null,"Errors found:",{"$f":"AY76+AY85+AY96+AY107","v":0},null,null,null,null,"Click>>>>>","Home",null,"Errors found:",{"$f":"BH76+BH85+BH96+BH107","v":0},null,null,null,null,"Click>>>>>","Home",null,"Errors found:",{"$f":"BQ76+BQ85+BQ96+BQ107","v":0},null,null,null,null,"Click>>>>>","Home",null,"Errors found:",{"$f":"BZ76+BZ85+BZ96+BZ107","v":0},null,null,null,null,"Click>>>>>","Home",null,"Errors found:",{"$f":"CI76+CI85+CI96+CI107","v":0},null,null,null,null,"Click>>>>>","Home",null,"Errors found:",{"$f":"CR76+CR85+CR96+CR107","v":0}]
["PARITY PASS/FAIL RESULTS, BY BENEFIT CLASSIFICATION"]
[]
[null,"Overall Result:",{"$f":"IF(AND(I28=\"Pass\",OR(I30=\"Pass\",AND(I32=\"Pass\",I33=\"Pass\")),E36=\"Pass\",E37=\"Pass\"),\"Pass\",\"Fail\")","v":"Fail"},null,"<<<<Click the links in the cells below to scroll directly to the stated section>>>>>",null,null,null,null,null,"<<<<Click the links in the cells below to scroll directly to the stated section>>>>>",null,null,null,null,null,null,null,null,"<<<<Click the links in the cells below to scroll directly to the stated section>>>>>",null,null,null,null,null,null,null,null,"<<<<Click the links in the cells below to scroll directly to the stated section>>>>>",null,null,null,null,null,null,null,null,"<<<<Click the links in the cells below to scroll directly to the stated section>>>>>",null,null,null,null,null,null,null,null,"<<<<Click the links in the cells below to scroll directly to the stated section>>>>>",null,null,null,null,null,null,null,null,"<<<<Click the links in the cells below to scroll directly to the stated section>>>>>",null,null,null,null,null,null,null,null,"<<<<Click the links in the cells below to scroll directly to the stated section>>>>>",null,null,null,null,null,null,null,null,"<<<<Click the links in the cells below to scroll directly to the stated section>>>>>",null,null,null,null,null,null,null,null,"<<<<Click the links in the cells below to scroll directly to the stated section>>>>>",null,null,null,null,null,null,null,null,"<<<<Click the links in the cells below to scroll directly to the stated section>>>>>"]
[null,null,null,null,"Move to IP INN","Move to IP OON","Move to OP INN","Move to OP-OV INN","Move to OP-AO INN",null,"Move to IP INN","Move to IP OON","Move to OP INN","Move to OP-OV INN","Move to OP-AO INN",null,null,null,null,"Move to IP INN","Move to IP OON","Move to OP INN","Move to OP-OV INN","Move to OP-AO INN",null,null,null,null,"Move to IP INN","Move to IP OON","Move to OP INN","Move to OP-OV INN","Move to OP-AO INN",null,null,null,null,"Move to IP INN","Move to IP OON","Move to OP INN","Move to OP-OV INN","Move to OP-AO INN",null,null,null,null,"Move to IP INN","Move to IP OON","Move to OP INN","Move to OP-OV INN","Move to OP-AO INN",null,null,null,null,"Move to IP INN","Move to IP OON","Move to OP INN","Move to OP-OV INN","Move to OP-AO INN",null,null,null,null,"Move to IP INN","Move to IP OON","Move to OP INN","Move to OP-OV INN","Move to OP-AO INN",null,null,null,null,"Move to IP INN","Move to IP OON","Move to OP INN","Move to OP-OV INN","Move to OP-AO INN",null,null,null,null,"Move to IP INN","Move to IP OON","Move to OP INN","Move to OP-OV INN","Move to OP-AO INN",null,null,null,null,"Move to IP INN","Move to IP OON","Move to OP INN","Move to OP-OV INN","Move to OP-AO INN"]
[null,null,"Links only work for sections that are not already hidden>>>>>",null,"Move to OP OON","Move to OP-OV OON","Move to OP-AO OON","Move to ER","Move to RX",null,"Move to OP OON","Move to OP-OV OON","Move to OP-AO OON","Move to ER","Move to RX",null,null,null,null,"Move to OP OON","Move to OP-OV OON","Move to OP-AO OON","Move to ER","Move to RX",null,null,null,null,"Move to OP OON","Move to OP-OV OON","Move to OP-AO OON","Move to ER","Move to RX",null,null,null,null,"Move to OP OON","Move to OP-OV OON","Move to OP-AO OON","Move to ER","Move to RX",null,null,null,null,"Move to OP OON","Move to OP-OV OON","Move to OP-AO OON","Move to ER","Move to RX",null,null,null,null,"Move to OP OON","Move to OP-OV OON","Move to OP-AO OON","Move to ER","Move to RX",null,null,null,null,"Move to OP OON","Move to OP-OV OON","Move to OP-AO OON","Move to ER","Move to RX",null,null,null,null,"Move to OP OON","Move to OP-OV OON","Move to OP-AO OON","Move to ER","Move to RX",null,null,null,null,"Move to OP OON","Move to OP-OV OON","Move to OP-AO OON","Move to ER","Move to RX",null,null,null,null,"Move to OP OON","Move to OP-OV OON","Move to OP-AO OON","Move to ER","Move to RX"]
[]
[null,"Testing Options"]
[null,"Option","Selection",null,"Column Options",null,"No Errors found?"]
[]
[null,"Out-of-Network Tier?","Select Input",null,"Update Columns",null,{"$f":"IF(O11+X11+AG11+AP11+AY11+BH11+BQ11+BZ11+CI11+CR11=0,TRUE,FALSE)","v":true}]
[null,"Outpatient Benefit Testing","Select Input",null,"Hide/Unhide All Columns"]
[]
[]
[null,"Results By Benefit Classification"]
[null,"A. Benefit Classification","B1. Do the MHSUD cost shares match all Medical/Surgical cost shares in the Benefit Classification? \n(In-Network)","C1. Test Required? \n(In-Network)","B2. Do the MHSUD cost shares match all Medical/Surgical cost shares in the Benefit Classification? \n(Out-of-Network)","C2. Test Required?\n (Out-of-Network)","D. By Network Tier",null,"E. Test Results"]
[null,null,null,null,null,null,"D1.\nIn-Network","D2. \nOut-of-Network"]
[null,"Inpatient","Select Input",{"$f":"IF(C28=\"Yes\",\"No\",\"Yes\")","v":"Yes"},"Select Input",{"$f":"IF(E28=\"Yes\",\"No\",\"Yes\")","v":"Yes"},{"$f":"N66","v":"Fail"},{"$f":"IF($C$21=\"No\",\"Pass\",W66)","v":"Pass"},{"$f":"IF(AND(G28=\"Pass\",H28=\"Pass\"),\"Pass\",\"Fail\")","v":"Fail"}]
[null,"Outpatient"]
[null,"Outpatient - All Services Combined","Select Input",{"$f":"IF(C22=\"All Combined\",IF(C30=\"Yes\",\"No\",\"Yes\"),\"No\")","v":"No"},"Select Input",{"$f":"IF(C22=\"All Combined\",IF(E30=\"Yes\",\"No\",\"Yes\"),\"No\")","v":"No"},{"$f":"AF66","v":"Pass"},{"$f":"IF($C$21=\"No\",\"Pass\",BG66)","v":"Pass"},{"$f":"IF(AND(G30=\"Pass\",H30=\"Pass\"),\"Pass\",\"Fail\")","v":"Pass"}]
[null,"Outpatient - Office Visits Separate"]
[null,"Outpatient - Office Visits","Select Input",{"$f":"IF(C22=\"Office Visits Separate\",IF(C32=\"Yes\",\"No\",\"Yes\"),\"No\")","v":"No"},"Select Input",{"$f":"IF(C22=\"Office Visits Separate\",IF(E32=\"Yes\",\"No\",\"Yes\"),\"No\")","v":"No"},{"$f":"AO66","v":"Pass"},{"$f":"IF($C$21=\"No\",\"Pass\",BP66)","v":"Pass"},{"$f":"IF(AND(G32=\"Pass\",H32=\"Pass\"),\"Pass\",\"Fail\")","v":"Pass"}]
[null,"Outpatient - All Other","Select Input",{"$f":"IF(C22=\"Office Visits Separate\",IF(C33=\"Yes\",\"No\",\"Yes\"),\"No\")","v":"No"},"Select Input",{"$f":"IF(C22=\"Office Visits Separate\",IF(E33=\"Yes\",\"No\",\"Yes\"),\"No\")","v":"No"},{"$f":"AX66","v":"Pass"},{"$f":"IF($C$21=\"No\",\"Pass\",BY66)","v":"Pass"},{"$f":"IF(AND(G33=\"Pass\",H33=\"Pass\"),\"Pass\",\"Fail\")","v":"Pass"}]
[]
[null,"A. Benefit Classification","B. Do the MHSUD cost shares match all Medical/Surgical cost shares in the Benefit Classification?","C. Test Required?","D. Test Results"]
[null,"Emergency Care","Select Input",{"$f":"IF(C36=\"Yes\",\"No\",\"Yes\")","v":"Yes"},{"$f":"IF(D36=\"No\",\"Pass\",CH66)","v":"Fail"}]
[null,"Prescription Drugs","Select Input",{"$f":"IF(C37=\"Yes\",\"No\",\"Yes\")","v":"Yes"},{"$f":"IF(D37=\"No\",\"Pass\",CQ66)","v":"Fail"}]
[null,null,null,null,null,null,null,null,null,null,"PART 1",null,null,null,null,null,null,null,null,"PART 1",null,null,null,null,null,null,null,null,"PART 1",null,null,null,null,null,null,null,null,"PART 1",null,null,null,null,null,null,null,null,"PART 1",null,null,null,null,null,null,null,null,"PART 1",null,null,null,null,null,null,null,null,"PART 1",null,null,null,null,null,null,null,null,"PART 1",null,null,null,null,null,null,null,null,"PART 1",null,null,null,null,null,null,null,null,"PART 1"]
[null,null,null,null,null,null,null,null,null,null,"COST SHARES FOR MEDICAL/SURGICAL BENEFITS, BY BENEFIT CLASSIFICATION",null,null,null,null,null,null,null,null,"COST SHARES FOR MEDICAL/SURGICAL BENEFITS, BY BENEFIT CLASSIFICATION",null,null,null,null,null,null,null,null,"COST SHARES FOR MEDICAL/SURGICAL BENEFITS, BY BENEFIT CLASSIFICATION",null,null,null,null,null,null,null,null,"COST SHARES FOR MEDICAL/SURGICAL BENEFITS, BY BENEFIT CLASSIFICATION",null,null,null,null,null,null,null,null,"COST SHARES FOR MEDICAL/SURGICAL BENEFITS, BY BENEFIT CLASSIFICATION",null,null,null,null,null,null,null,null,"COST SHARES FOR MEDICAL/SURGICAL BENEFITS, BY BENEFIT CLASSIFICATION",null,null,null,null,null,null,null,null,"COST SHARES FOR MEDICAL/SURGICAL BENEFITS, BY BENEFIT CLASSIFICATION",null,null,null,null,null,null,null,null,"COST SHARES FOR MEDICAL/SURGICAL BENEFITS, BY BENEFIT CLASSIFICATION",null,null,null,null,null,null,null,null,"COST SHARES FOR MEDICAL/SURGICAL BENEFITS, BY BENEFIT CLASSIFICATION",null,null,null,null,null,null,null,null,"COST SHARES FOR MEDICAL/SURGICAL BENEFITS, BY BENEFIT CLASSIFICATION"]
[null,null,null,null,null,null,null,null,null,null,"Benefit Classification",{"$f":"\"(\" &L45&\") \"&L43&\", \"&SUBSTITUTE(L44,\"N/A\",\"\")&\" (\"&M45&\")\"","v":"(1) Inpatient, In-Network (IP INN)"},null,null,null,null,null,null,null,"Benefit Classification",{"$f":"\"(\" &U45&\") \"&U43&\", \"&SUBSTITUTE(U44,\"N/A\",\"\")&\" (\"&V45&\")\"","v":"(2) Inpatient, Out-of-Network (IP OON)"},null,null,null,null,null,null,null,"Benefit Classification",{"$f":"\"(\" &AD45&\") \"&AD43&\", \"&SUBSTITUTE(AD44,\"N/A\",\"\")&\" (\"&AE45&\")\"","v":"(3) Outpatient, In-Network (OP INN)"},null,null,null,null,null,null,null,"Benefit Classification",{"$f":"\"(\" &AM45&\") \"&AM43&\", \"&SUBSTITUTE(AM44,\"N/A\",\"\")&\" (\"&AN45&\")\"","v":"(3a) Outpatient - Office Visits, In-Network (OP-OV INN)"},null,null,null,null,null,null,null,"Benefit Classification",{"$f":"\"(\" &AV45&\") \"&AV43&\", \"&SUBSTITUTE(AV44,\"N/A\",\"\")&\" (\"&AW45&\")\"","v":"(3b) Outpatient - All Other, In-Network (OP-AO INN)"},null,null,null,null,null,null,null,"Benefit Classification",{"$f":"\"(\" &BE45&\") \"&BE43&\", \"&SUBSTITUTE(BE44,\"N/A\",\"\")&\" (\"&BF45&\")\"","v":"(4) Outpatient, Out-of-Network (OP OON)"},null,null,null,null,null,null,null,"Benefit Classification",{"$f":"\"(\" &BN45&\") \"&BN43&\", \"&SUBSTITUTE(BN44,\"N/A\",\"\")&\" (\"&BO45&\")\"","v":"(4a) Outpatient - Office Visits, Out-of-Network (OP-OV OON)"},null,null,null,null,null,null,null,"Benefit Classification",{"$f":"\"(\" &BW45&\") \"&BW43&\", \"&SUBSTITUTE(BW44,\"N/A\",\"\")&\" (\"&BX45&\")\"","v":"(4b) Outpatient - All Other, Out-of-Network (OP-AO OON)"},null,null,null,null,null,null,null,"Benefit Classification",{"$f":"\"(\" &CF45&\") \"&CF43&\", \"&SUBSTITUTE(CF44,\"N/A\",\"\")&\" (\"&CG45&\")\"","v":"(5) Emergency Care,  (ER )"},null,null,null,null,null,null,null,"Benefit Classification",{"$f":"\"(\" &CO45&\") \"&CO43&\", \"&SUBSTITUTE(CO44,\"N/A\",\"\")&\" (\"&CP45&\")\"","v":"(6) Prescription Drugs,  (RX )"}]
[null,null,null,null,null,null,null,null,null,null,null,null,null,null,null,null,null,null,null,null,null,null,null,null,null,null,null,null,"Notes:","Use this table if you are testing all outpatient services combined.",null,null,null,null,null,null,null,"Notes:","Use this table if you are separately testing outpatient office visits and all other outpatient services.",null,null,null,null,null,null,null,"Notes:",{"$f":"AM41","v":"Use this table if you are separately testing outpatient office visits and all other outpatient services."},null,null,null,null,null,null,null,"Notes:","Use this table if you are testing all outpatient services combined.",null,null,null,null,null,null,null,"Notes:",{"$f":"AM41","v":"Use this table if you are separately testing outpatient office visits and all other outpatient services."},null,null,null,null,null,null,null,"Notes:",{"$f":"BN41","v":"Use this table if you are separately testing outpatient office visits and all other outpatient services."}]
[]
[null,null,null,null,null,null,null,null,null,null,"Classification","Inpatient",{"$f":"VLOOKUP(L43,LookupTables!$F$4:$G$9,2,FALSE)","v":"IP"},null,null,null,null,null,null,"Classification","Inpatient",{"$f":"VLOOKUP(U43,LookupTables!$F$4:$G$9,2,FALSE)","v":"IP"},null,null,null,null,null,null,"Classification","Outpatient",{"$f":"VLOOKUP(AD43,LookupTables!$F$4:$G$9,2,FALSE)","v":"OP"},null,null,null,null,null,null,"Classification","Outpatient - Office Visits",{"$f":"VLOOKUP(AM43,LookupTables!$F$4:$G$9,2,FALSE)","v":"OP-OV"},null,null,null,null,null,null,"Classification","Outpatient - All Other",{"$f":"VLOOKUP(AV43,LookupTables!$F$4:$G$9,2,FALSE)","v":"OP-AO"},null,null,null,null,null,null,"Classification","Outpatient",{"$f":"VLOOKUP(BE43,LookupTables!$F$4:$G$9,2,FALSE)","v":"OP"},null,null,null,null,null,null,"Classification","Outpatient - Office Visits",{"$f":"VLOOKUP(BN43,LookupTables!$F$4:$G$9,2,FALSE)","v":"OP-OV"},null,null,null,null,null,null,"Classification","Outpatient - All Other",{"$f":"VLOOKUP(BW43,LookupTables!$F$4:$G$9,2,FALSE)","v":"OP-AO"},null,null,null,null,null,null,"Classification","Emergency Care",{"$f":"VLOOKUP(CF43,LookupTables!$F$4:$G$9,2,FALSE)","v":"ER"},null,null,null,null,null,null,"Classification","Prescription Drugs",{"$f":"VLOOKUP(CO43,LookupTables!$F$4:$G$9,2,FALSE)","v":"RX"}]
[null,null,null,null,null,null,null,null,null,null,"Network (In/Out)","In-Network",{"$f":"VLOOKUP(L44,LookupTables!$C$4:$D$6,2,0)","v":"INN"},null,null,null,null,null,null,"Network (In/Out)","Out-of-Network",{"$f":"VLOOKUP(U44,LookupTables!$C$4:$D$6,2,0)","v":"OON"},null,null,null,null,null,null,"Network (In/Out)","In-Network",{"$f":"VLOOKUP(AD44,LookupTables!$C$4:$D$6,2,0)","v":"INN"},null,null,null,null,null,null,"Network (In/Out)","In-Network",{"$f":"VLOOKUP(AM44,LookupTables!$C$4:$D$6,2,0)","v":"INN"},null,null,null,null,null,null,"Network (In/Out)","In-Network",{"$f":"VLOOKUP(AV44,LookupTables!$C$4:$D$6,2,0)","v":"INN"},null,null,null,null,null,null,"Network (In/Out)","Out-of-Network",{"$f":"VLOOKUP(BE44,LookupTables!$C$4:$D$6,2,0)","v":"OON"},null,null,null,null,null,null,"Network (In/Out)","Out-of-Network",{"$f":"VLOOKUP(BN44,LookupTables!$C$4:$D$6,2,0)","v":"OON"},null,null,null,null,null,null,"Network (In/Out)","Out-of-Network",{"$f":"VLOOKUP(BW44,LookupTables!$C$4:$D$6,2,0)","v":"OON"},null,null,null,null,null,null,"Network (In/Out)","N/A",{"$f":"VLOOKUP(CF44,LookupTables!$C$4:$D$6,2,0)","v":""},null,null,null,null,null,null,"Network (In/Out)","N/A",{"$f":"VLOOKUP(CO44,LookupTables!$C$4:$D$6,2,0)","v":""}]
[null,null,null,null,null,null,null,null,null,null,"Classification Code",1,{"$f":"M43&\" \"&M44","v":"IP INN"},null,null,null,"Number of Rows",6,null,"Classification Code",2,{"$f":"V43&\" \"&V44","v":"IP OON"},null,null,null,"Number of Rows","6",null,"Classification Code",3,{"$f":"AE43&\" \"&AE44","v":"OP INN"},null,null,null,"Number of Rows","6",null,"Classification Code","3a",{"$f":"AN43&\" \"&AN44","v":"OP-OV INN"},null,null,null,"Number of Rows","6",null,"Classification Code","3b",{"$f":"AW43&\" \"&AW44","v":"OP-AO INN"},null,null,null,"Number of Rows","6",null,"Classification Code",4,{"$f":"BF43&\" \"&BF44","v":"OP OON"},null,null,null,"Number of Rows","6",null,"Classification Code","4a",{"$f":"BO43&\" \"&BO44","v":"OP-OV OON"},null,null,null,"Number of Rows","6",null,"Classification Code","4b",{"$f":"BX43&\" \"&BX44","v":"OP-AO OON"},null,null,null,"Number of Rows","6",null,"Classification Code",5,{"$f":"CG43&\" \"&CG44","v":"ER "},null,null,null,"Number of Rows","6",null,"Classification Code",6,{"$f":"CP43&\" \"&CP44","v":"RX "}]
[null,null,null,null,null,null,null,null,null,null,"Table Name",null,{"$f":"SUBSTITUTE(SUBSTITUTE(\"tbl_\"&M45&\"_P1\",\" \",\"\"),\"-\",\"\")","v":"tbl_IPINN_P1"},null,null,null,null,null,null,"Table Name",null,{"$f":"SUBSTITUTE(SUBSTITUTE(\"tbl_\"&V45&\"_P1\",\" \",\"\"),\"-\",\"\")","v":"tbl_IPOON_P1"},null,null,null,null,null,null,"Table Name",null,{"$f":"SUBSTITUTE(SUBSTITUTE(\"tbl_\"&AE45&\"_P1\",\" \",\"\"),\"-\",\"\")","v":"tbl_OPINN_P1"},null,null,null,null,null,null,"Table Name",null,{"$f":"SUBSTITUTE(SUBSTITUTE(\"tbl_\"&AN45&\"_P1\",\" \",\"\"),\"-\",\"\")","v":"tbl_OPOVINN_P1"},null,null,null,null,null,null,"Table Name",null,{"$f":"SUBSTITUTE(SUBSTITUTE(\"tbl_\"&AW45&\"_P1\",\" \",\"\"),\"-\",\"\")","v":"tbl_OPAOINN_P1"},null,null,null,null,null,null,"Table Name",null,{"$f":"SUBSTITUTE(SUBSTITUTE(\"tbl_\"&BF45&\"_P1\",\" \",\"\"),\"-\",\"\")","v":"tbl_OPOON_P1"},null,null,null,null,null,null,"Table Name",null,{"$f":"SUBSTITUTE(SUBSTITUTE(\"tbl_\"&BO45&\"_P1\",\" \",\"\"),\"-\",\"\")","v":"tbl_OPOVOON_P1"},null,null,null,null,null,null,"Table Name",null,{"$f":"SUBSTITUTE(SUBSTITUTE(\"tbl_\"&BX45&\"_P1\",\" \",\"\"),\"-\",\"\")","v":"tbl_OPAOOON_P1"},null,null,null,null,null,null,"Table Name",null,{"$f":"SUBSTITUTE(SUBSTITUTE(\"tbl_\"&CG45&\"_P1\",\" \",\"\"),\"-\",\"\")","v":"tbl_ER_P1"},null,null,null,null,null,null,"Table Name",null,{"$f":"SUBSTITUTE(SUBSTITUTE(\"tbl_\"&CP45&\"_P1\",\" \",\"\"),\"-\",\"\")","v":"tbl_RX_P1"},null,null,null,"Number of Rows","6"]
[null,null,null,null,null,null,null,null,null,null,"For each cost share, if it does not apply, enter \"N/A\".",null,null,null,null,null,null,null,null,"For each cost share, if it does not apply, enter \"N/A\".",null,null,null,null,null,null,null,null,"For each cost share, if it does not apply, enter \"N/A\".",null,null,null,null,null,null,null,null,"For each cost share, if it does not apply, enter \"N/A\".",null,null,null,null,null,null,null,null,"For each cost share, if it does not apply, enter \"N/A\".",null,null,null,null,null,null,null,null,"For each cost share, if it does not apply, enter \"N/A\".",null,null,null,null,null,null,null,null,"For each cost share, if it does not apply, enter \"N/A\".",null,null,null,null,null,null,null,null,"For each cost share, if it does not apply, enter \"N/A\".",null,null,null,null,null,null,null,null,"For each cost share, if it does not apply, enter \"N/A\".",null,null,null,null,null,null,null,null,"For each cost share, if it does not apply, enter \"N/A\"."]
[null,null,null,null,null,null,null,null,null,null,"Service Description","Cost-Share Description","Plan Projected Allowed Amount","Deductible","Copayment","Coinsurance","Out-of-Pocket Maximum (OOPM)","No Cost-Share\n(If true, \nenter \"x\")",null,"Service Description","Cost-Share Description","Plan Projected Allowed Amount","Deductible","Copayment","Coinsurance","Out-of-Pocket Maximum (OOPM)","No Cost-Share\n(If true, \nenter \"x\")",null,"Service Description","Cost-Share Description","Plan Projected Allowed Amount","Deductible","Copayment","Coinsurance","Out-of-Pocket Maximum (OOPM)","No Cost-Share\n(If true, \nenter \"x\")",null,"Service Description","Cost-Share Description","Plan Projected Allowed Amount","Deductible","Copayment","Coinsurance","Out-of-Pocket Maximum (OOPM)","No Cost-Share\n(If true, \nenter \"x\")",null,"Service Description","Cost-Share Description","Plan Projected Allowed Amount","Deductible","Copayment","Coinsurance","Out-of-Pocket Maximum (OOPM)","No Cost-Share\n(If true, \nenter \"x\")",null,"Service Description","Cost-Share Description","Plan Projected Allowed Amount","Deductible","Copayment","Coinsurance","Out-of-Pocket Maximum (OOPM)","No Cost-Share\n(If true, \nenter \"x\")",null,"Service Description","Cost-Share Description","Plan Projected Allowed Amount","Deductible","Copayment","Coinsurance","Out-of-Pocket Maximum (OOPM)","No Cost-Share\n(If true, \nenter \"x\")",null,"Service Description","Cost-Share Description","Plan Projected Allowed Amount","Deductible","Copayment","Coinsurance","Out-of-Pocket Maximum (OOPM)","No Cost-Share\n(If true, \nenter \"x\")",null,"Service Description","Cost-Share Description","Plan Projected Allowed Amount","Deductible","Copayment","Coinsurance","Out-of-Pocket Maximum (OOPM)","No Cost-Share\n(If true, \nenter \"x\")",null,"Service Description","Cost-Share Description","Plan Projected Allowed Amount","Deductible","Copayment","Coinsurance","Out-of-Pocket Maximum (OOPM)","No Cost-Share\n(If true, \nenter \"x\")"]
[null,null,null,null,null,null,null,null,null,null,null,null,null,null,null,null,null,null,null,"<<Enter description>>","<<Enter description>>",null,null,null,null,null,null,null,"<<Enter description>>","<<Enter description>>",null,null,null,null,null,null,null,"<<Enter description>>","<<Enter description>>",null,null,null,null,null,null,null,"<<Enter description>>","<<Enter description>>",null,null,null,null,null,null,null,"<<Enter description>>","<<Enter description>>",null,null,null,null,null,null,null,"<<Enter description>>","<<Enter description>>",null,null,null,null,null,null,null,"<<Enter description>>","<<Enter description>>",null,null,null,null,null,null,null,"<<Enter description>>","<<Enter description>>",null,null,null,null,null,null,null,"<<Enter description>>","<<Enter description>>"]
[]
[]
[]
[]
[]
[null,null,null,null,null,null,null,null,null,null,"Total Row",null,{"$f":"SUBTOTAL(109,tbl_IPINN_P1[Plan Projected Allowed Amount])","v":0},null,null,null,null,null,null,"Total Row",null,{"$f":"SUBTOTAL(109,tbl_IPOON_P1[Plan Projected Allowed Amount])","v":0},null,null,null,null,null,null,"Total Row",null,{"$f":"SUBTOTAL(109,tbl_OPINN_P1[Plan Projected Allowed Amount])","v":0},null,null,null,null,null,null,"Total Row",null,{"$f":"SUBTOTAL(109,tbl_OPOVINN_P1[Plan Projected Allowed Amount])","v":0},null,null,null,null,null,null,"Total Row",null,{"$f":"SUBTOTAL(109,tbl_OPAOINN_P1[Plan Projected Allowed Amount])","v":0},null,null,null,null,null,null,"Total Row",null,{"$f":"SUBTOTAL(109,tbl_OPOON_P1[Plan Projected Allowed Amount])","v":0},null,null,null,null,null,null,"Total Row",null,{"$f":"SUBTOTAL(109,tbl_OPOVOON_P1[Plan Projected Allowed Amount])","v":0},null,null,null,null,null,null,"Total Row",null,{"$f":"SUBTOTAL(109,tbl_OPAOOON_P1[Plan Projected Allowed Amount])","v":0},null,null,null,null,null,null,"Total Row",null,{"$f":"SUBTOTAL(109,tbl_ER_P1[Plan Projected Allowed Amount])","v":0},null,null,null,null,null,null,"Total Row",null,{"$f":"SUBTOTAL(109,tbl_RX_P1[Plan Projected Allowed Amount])","v":0}]
[]
[null,null,null,null,null,null,null,null,null,null,"PART 2",null,null,null,null,null,null,null,null,"PART 2",null,null,null,null,null,null,null,null,"PART 2",null,null,null,null,null,null,null,null,"PART 2",null,null,null,null,null,null,null,null,"PART 2",null,null,null,null,null,null,null,null,"PART 2",null,null,null,null,null,null,null,null,"PART 2",null,null,null,null,null,null,null,null,"PART 2",null,null,null,null,null,null,null,null,"PART 2",null,null,null,null,null,null,null,null,"PART 2"]
[null,null,null,null,null,null,null,null,null,null,"ANALYSIS OF MHSUD FINANCIAL REQUIREMENT PARITY, BY BENEFIT CLASSIFICATION",null,null,null,null,null,null,null,null,"ANALYSIS OF MHSUD FINANCIAL REQUIREMENT PARITY, BY BENEFIT CLASSIFICATION",null,null,null,null,null,null,null,null,"ANALYSIS OF MHSUD FINANCIAL REQUIREMENT PARITY, BY BENEFIT CLASSIFICATION",null,null,null,null,null,null,null,null,"ANALYSIS OF MHSUD FINANCIAL REQUIREMENT PARITY, BY BENEFIT CLASSIFICATION",null,null,null,null,null,null,null,null,"ANALYSIS OF MHSUD FINANCIAL REQUIREMENT PARITY, BY BENEFIT CLASSIFICATION",null,null,null,null,null,null,null,null,"ANALYSIS OF MHSUD FINANCIAL REQUIREMENT PARITY, BY BENEFIT CLASSIFICATION",null,null,null,null,null,null,null,null,"ANALYSIS OF MHSUD FINANCIAL REQUIREMENT PARITY, BY BENEFIT CLASSIFICATION",null,null,null,null,null,null,null,null,"ANALYSIS OF MHSUD FINANCIAL REQUIREMENT PARITY, BY BENEFIT CLASSIFICATION",null,null,null,null,null,null,null,null,"ANALYSIS OF MHSUD FINANCIAL REQUIREMENT PARITY, BY BENEFIT CLASSIFICATION",null,null,null,null,null,null,null,null,"ANALYSIS OF MHSUD FINANCIAL REQUIREMENT PARITY, BY BENEFIT CLASSIFICATION"]
[]
[null,null,null,null,null,null,null,null,null,null,{"$f":"\"Financial Parity for \"&L40","v":"Financial Parity for (1) Inpatient, In-Network (IP INN)"},null,null,null,null,null,null,null,null,{"$f":"\"Financial Parity for \"&U40","v":"Financial Parity for (2) Inpatient, Out-of-Network (IP OON)"},null,null,null,null,null,null,null,null,{"$f":"\"Financial Parity for \"&AD40","v":"Financial Parity for (3) Outpatient, In-Network (OP INN)"},null,null,null,null,null,null,null,null,{"$f":"\"Financial Parity for \"&AM40","v":"Financial Parity for (3a) Outpatient - Office Visits, In-Network (OP-OV INN)"},null,null,null,null,null,null,null,null,{"$f":"\"Financial Parity for \"&AV40","v":"Financial Parity for (3b) Outpatient - All Other, In-Network (OP-AO INN)"},null,null,null,null,null,null,null,null,{"$f":"\"Financial Parity for \"&BE40","v":"Financial Parity for (4) Outpatient, Out-of-Network (OP OON)"},null,null,null,null,null,null,null,null,{"$f":"\"Financial Parity for \"&BN40","v":"Financial Parity for (4a) Outpatient - Office Visits, Out-of-Network (OP-OV OON)"},null,null,null,null,null,null,null,null,{"$f":"\"Financial Parity for \"&BW40","v":"Financial Parity for (4b) Outpatient - All Other, Out-of-Network (OP-AO OON)"},null,null,null,null,null,null,null,null,{"$f":"\"Financial Parity for \"&CF40","v":"Financial Parity for (5) Emergency Care,  (ER )"},null,null,null,null,null,null,null,null,{"$f":"\"Financial Parity for \"&CO40","v":"Financial Parity for (6) Prescription Drugs,  (RX )"}]
[null,null,null,null,null,null,null,null,null,null,"Cost-Share Type","MHSUD Cost Shares\nin Plan Design*","Predominant Level for Medical/ Surgical","MHSUD Financial Parity Result",null,"Enter Footnotes \n(as needed) about\nMHSUD Cost Shares\nin the Plan Design",null,null,null,"Cost-Share Type","MHSUD Cost Shares\nin Plan Design*","Predominant Level for Medical/ Surgical","MHSUD Financial Parity Result",null,"Enter Footnotes \n(as needed) about\nMHSUD Cost Shares\nin the Plan Design",null,null,null,"Cost-Share Type","MHSUD Cost Shares\nin Plan Design*","Predominant Level for Medical/ Surgical","MHSUD Financial Parity Result",null,"Enter Footnotes \n(as needed) about\nMHSUD Cost Shares\nin the Plan Design",null,null,null,"Cost-Share Type","MHSUD Cost Shares\nin Plan Design*","Predominant Level for Medical/ Surgical","MHSUD Financial Parity Result",null,"Enter Footnotes \n(as needed) about\nMHSUD Cost Shares\nin the Plan Design",null,null,null,"Cost-Share Type","MHSUD Cost Shares\nin Plan Design*","Predominant Level for Medical/ Surgical","MHSUD Financial Parity Result",null,"Enter Footnotes \n(as needed) about\nMHSUD Cost Shares\nin the Plan Design",null,null,null,"Cost-Share Type","MHSUD Cost Shares\nin Plan Design*","Predominant Level for Medical/ Surgical","MHSUD Financial Parity Result",null,"Enter Footnotes \n(as needed) about\nMHSUD Cost Shares\nin the Plan Design",null,null,null,"Cost-Share Type","MHSUD Cost Shares\nin Plan Design*","Predominant Level for Medical/ Surgical","MHSUD Financial Parity Result",null,"Enter Footnotes \n(as needed) about\nMHSUD Cost Shares\nin the Plan Design",null,null,null,"Cost-Share Type","MHSUD Cost Shares\nin Plan Design*","Predominant Level for Medical/ Surgical","MHSUD Financial Parity Result",null,"Enter Footnotes \n(as needed) about\nMHSUD Cost Shares\nin the Plan Design",null,null,null,"Cost-Share Type","MHSUD Cost Shares\nin Plan Design*","Predominant Level for Medical/ Surgical","MHSUD Financial Parity Result",null,"Enter Footnotes \n(as needed) about\nMHSUD Cost Shares\nin the Plan Design",null,null,null,"Cost-Share Type","MHSUD Cost Shares\nin Plan Design*","Predominant Level for Medical/ Surgical","MHSUD Financial Parity Result",null,"Enter Footnotes \n(as needed) about\nMHSUD Cost Shares\nin the Plan Design"]
[null,null,null,null,null,null,null,null,null,null,"Deductible",null,{"$f":"IF(OR(N69=\"Fail\",N69=\"N/A\"),N69,MAX(tbl_IPINN_P2Ded[Predominant & Smaller]))","v":"Fail"},{"$f":"IF(AND(OR(L62=\"\",L62=\"N/A\"),N69=\"N/A\"),\"N/A\",IF(AND(OR(M62=\"N/A\",M62=\"Fail\"),OR(L62=\"N/A\",L62=\"Not Applicable\")),\"Pass\",IF(M62=\"Fail\",M62,IF(L62=\"\",\"Fail - Enter MHSUD cost share\",IF(AND(M62<>\"N/A\",M62<>\"Fail\",OR(AND(L62<=M62,L62>=0),L62=\"N/A\",L62=\"Not Applicable\")),\"Pass\",\"Fail\")))))","v":"Fail"},null,"xx",null,null,null,"Deductible",null,{"$f":"IF(OR(W69=\"Fail\",W69=\"N/A\"),W69,MAX(tbl_IPOON_P2Ded[Predominant & Smaller]))","v":"N/A"},{"$f":"IF(AND(OR(U62=\"\",U62=\"N/A\"),W69=\"N/A\"),\"N/A\",IF(AND(OR(V62=\"N/A\",V62=\"Fail\"),OR(U62=\"N/A\",U62=\"Not Applicable\")),\"Pass\",IF(V62=\"Fail\",V62,IF(U62=\"\",\"Fail - Enter MHSUD cost share\",IF(AND(V62<>\"N/A\",V62<>\"Fail\",OR(AND(U62<=V62,U62>=0),U62=\"N/A\",U62=\"Not Applicable\")),\"Pass\",\"Fail\")))))","v":"N/A"},null,"xx",null,null,null,"Deductible",null,{"$f":"IF(OR(AF69=\"Fail\",AF69=\"N/A\"),AF69,MAX(tbl_OPINN_P2Ded[Predominant & Smaller]))","v":"N/A"},{"$f":"IF(AND(OR(AD62=\"\",AD62=\"N/A\"),AF69=\"N/A\"),\"N/A\",IF(AND(OR(AE62=\"N/A\",AE62=\"Fail\"),OR(AD62=\"N/A\",AD62=\"Not Applicable\")),\"Pass\",IF(AE62=\"Fail\",AE62,IF(AD62=\"\",\"Fail - Enter MHSUD cost share\",IF(AND(AE62<>\"N/A\",AE62<>\"Fail\",OR(AND(AD62<=AE62,AD62>=0),AD62=\"N/A\",AD62=\"Not Applicable\")),\"Pass\",\"Fail\")))))","v":"N/A"},null,"xx",null,null,null,"Deductible",null,{"$f":"IF(OR(AO69=\"Fail\",AO69=\"N/A\"),AO69,MAX(tbl_OPOVINN_P2Ded[Predominant & Smaller]))","v":"N/A"},{"$f":"IF(AND(OR(AM62=\"\",AM62=\"N/A\"),AO69=\"N/A\"),\"N/A\",IF(AND(OR(AN62=\"N/A\",AN62=\"Fail\"),OR(AM62=\"N/A\",AM62=\"Not Applicable\")),\"Pass\",IF(AN62=\"Fail\",AN62,IF(AM62=\"\",\"Fail - Enter MHSUD cost share\",IF(AND(AN62<>\"N/A\",AN62<>\"Fail\",OR(AND(AM62<=AN62,AM62>=0),AM62=\"N/A\",AM62=\"Not Applicable\")),\"Pass\",\"Fail\")))))","v":"N/A"},null,"xx",null,null,null,"Deductible",null,{"$f":"IF(OR(AX69=\"Fail\",AX69=\"N/A\"),AX69,MAX(tbl_OPAOINN_P2Ded[Predominant & Smaller]))","v":"N/A"},{"$f":"IF(AND(OR(AV62=\"\",AV62=\"N/A\"),AX69=\"N/A\"),\"N/A\",IF(AND(OR(AW62=\"N/A\",AW62=\"Fail\"),OR(AV62=\"N/A\",AV62=\"Not Applicable\")),\"Pass\",IF(AW62=\"Fail\",AW62,IF(AV62=\"\",\"Fail - Enter MHSUD cost share\",IF(AND(AW62<>\"N/A\",AW62<>\"Fail\",OR(AND(AV62<=AW62,AV62>=0),AV62=\"N/A\",AV62=\"Not Applicable\")),\"Pass\",\"Fail\")))))","v":"N/A"},null,"xx",null,null,null,"Deductible",null,{"$f":"IF(OR(BG69=\"Fail\",BG69=\"N/A\"),BG69,MAX(tbl_OPOON_P2Ded[Predominant & Smaller]))","v":"N/A"},{"$f":"IF(AND(OR(BE62=\"\",BE62=\"N/A\"),BG69=\"N/A\"),\"N/A\",IF(AND(OR(BF62=\"N/A\",BF62=\"Fail\"),OR(BE62=\"N/A\",BE62=\"Not Applicable\")),\"Pass\",IF(BF62=\"Fail\",BF62,IF(BE62=\"\",\"Fail - Enter MHSUD cost share\",IF(AND(BF62<>\"N/A\",BF62<>\"Fail\",OR(AND(BE62<=BF62,BE62>=0),BE62=\"N/A\",BE62=\"Not Applicable\")),\"Pass\",\"Fail\")))))","v":"N/A"},null,"xx",null,null,null,"Deductible",null,{"$f":"IF(OR(BP69=\"Fail\",BP69=\"N/A\"),BP69,MAX(tbl_OPOVOON_P2Ded[Predominant & Smaller]))","v":"N/A"},{"$f":"IF(AND(OR(BN62=\"\",BN62=\"N/A\"),BP69=\"N/A\"),\"N/A\",IF(AND(OR(BO62=\"N/A\",BO62=\"Fail\"),OR(BN62=\"N/A\",BN62=\"Not Applicable\")),\"Pass\",IF(BO62=\"Fail\",BO62,IF(BN62=\"\",\"Fail - Enter MHSUD cost share\",IF(AND(BO62<>\"N/A\",BO62<>\"Fail\",OR(AND(BN62<=BO62,BN62>=0),BN62=\"N/A\",BN62=\"Not Applicable\")),\"Pass\",\"Fail\")))))","v":"N/A"},null,"xx",null,null,null,"Deductible",null,{"$f":"IF(OR(BY69=\"Fail\",BY69=\"N/A\"),BY69,MAX(tbl_OPAOOON_P2Ded[Predominant & Smaller]))","v":"N/A"},{"$f":"IF(AND(OR(BW62=\"\",BW62=\"N/A\"),BY69=\"N/A\"),\"N/A\",IF(AND(OR(BX62=\"N/A\",BX62=\"Fail\"),OR(BW62=\"N/A\",BW62=\"Not Applicable\")),\"Pass\",IF(BX62=\"Fail\",BX62,IF(BW62=\"\",\"Fail - Enter MHSUD cost share\",IF(AND(BX62<>\"N/A\",BX62<>\"Fail\",OR(AND(BW62<=BX62,BW62>=0),BW62=\"N/A\",BW62=\"Not Applicable\")),\"Pass\",\"Fail\")))))","v":"N/A"},null,"xx",null,null,null,"Deductible",null,{"$f":"IF(OR(CH69=\"Fail\",CH69=\"N/A\"),CH69,MAX(tbl_ER_P2Ded[Predominant & Smaller]))","v":"Fail"},{"$f":"IF(AND(OR(CF62=\"\",CF62=\"N/A\"),CH69=\"N/A\"),\"N/A\",IF(AND(OR(CG62=\"N/A\",CG62=\"Fail\"),OR(CF62=\"N/A\",CF62=\"Not Applicable\")),\"Pass\",IF(CG62=\"Fail\",CG62,IF(CF62=\"\",\"Fail - Enter MHSUD cost share\",IF(AND(CG62<>\"N/A\",CG62<>\"Fail\",OR(AND(CF62<=CG62,CF62>=0),CF62=\"N/A\",CF62=\"Not Applicable\")),\"Pass\",\"Fail\")))))","v":"Fail"},null,"xx",null,null,null,"Deductible",null,{"$f":"IF(OR(CQ69=\"Fail\",CQ69=\"N/A\"),CQ69,MAX(tbl_RX_P2Ded[Predominant & Smaller]))","v":"Fail"},{"$f":"IF(AND(OR(CO62=\"\",CO62=\"N/A\"),CQ69=\"N/A\"),\"N/A\",IF(AND(OR(CP62=\"N/A\",CP62=\"Fail\"),OR(CO62=\"N/A\",CO62=\"Not Applicable\")),\"Pass\",IF(CP62=\"Fail\",CP62,IF(CO62=\"\",\"Fail - Enter MHSUD cost share\",IF(AND(CP62<>\"N/A\",CP62<>\"Fail\",OR(AND(CO62<=CP62,CO62>=0),CO62=\"N/A\",CO62=\"Not Applicable\")),\"Pass\",\"Fail\")))))","v":"Fail"},null,"xx"]
[null,null,null,null,null,null,null,null,null,null,"Copayment",null,{"$f":"IF(OR(N70=\"Fail\",N70=\"N/A\"),N70,MAX(tbl_IPINN_P2Cop[Predominant & Smaller]))","v":"Fail"},{"$f":"IF(AND(OR(L63=\"\",L63=\"N/A\"),N70=\"N/A\"),\"N/A\",IF(AND(OR(M63=\"N/A\",M63=\"Fail\"),OR(L63=\"N/A\",L63=\"Not Applicable\")),\"Pass\",IF(M63=\"Fail\",M63,IF(L63=\"\",\"Fail - Enter MHSUD cost share\",IF(AND(M63<>\"N/A\",M63<>\"Fail\",OR(AND(L63<=M63,L63>=0),L63=\"N/A\",L63=\"Not Applicable\")),\"Pass\",\"Fail\")))))","v":"Fail"},null,null,null,null,null,"Copayment",null,{"$f":"IF(OR(W70=\"Fail\",W70=\"N/A\"),W70,MAX(tbl_IPOON_P2Cop[Predominant & Smaller]))","v":"N/A"},{"$f":"IF(AND(OR(U63=\"\",U63=\"N/A\"),W70=\"N/A\"),\"N/A\",IF(AND(OR(V63=\"N/A\",V63=\"Fail\"),OR(U63=\"N/A\",U63=\"Not Applicable\")),\"Pass\",IF(V63=\"Fail\",V63,IF(U63=\"\",\"Fail - Enter MHSUD cost share\",IF(AND(V63<>\"N/A\",V63<>\"Fail\",OR(AND(U63<=V63,U63>=0),U63=\"N/A\",U63=\"Not Applicable\")),\"Pass\",\"Fail\")))))","v":"N/A"},null,null,null,null,null,"Copayment",null,{"$f":"IF(OR(AF70=\"Fail\",AF70=\"N/A\"),AF70,MAX(tbl_OPINN_P2Cop[Predominant & Smaller]))","v":"N/A"},{"$f":"IF(AND(OR(AD63=\"\",AD63=\"N/A\"),AF70=\"N/A\"),\"N/A\",IF(AND(OR(AE63=\"N/A\",AE63=\"Fail\"),OR(AD63=\"N/A\",AD63=\"Not Applicable\")),\"Pass\",IF(AE63=\"Fail\",AE63,IF(AD63=\"\",\"Fail - Enter MHSUD cost share\",IF(AND(AE63<>\"N/A\",AE63<>\"Fail\",OR(AND(AD63<=AE63,AD63>=0),AD63=\"N/A\",AD63=\"Not Applicable\")),\"Pass\",\"Fail\")))))","v":"N/A"},null,null,null,null,null,"Copayment",null,{"$f":"IF(OR(AO70=\"Fail\",AO70=\"N/A\"),AO70,MAX(tbl_OPOVINN_P2Cop[Predominant & Smaller]))","v":"N/A"},{"$f":"IF(AND(OR(AM63=\"\",AM63=\"N/A\"),AO70=\"N/A\"),\"N/A\",IF(AND(OR(AN63=\"N/A\",AN63=\"Fail\"),OR(AM63=\"N/A\",AM63=\"Not Applicable\")),\"Pass\",IF(AN63=\"Fail\",AN63,IF(AM63=\"\",\"Fail - Enter MHSUD cost share\",IF(AND(AN63<>\"N/A\",AN63<>\"Fail\",OR(AND(AM63<=AN63,AM63>=0),AM63=\"N/A\",AM63=\"Not Applicable\")),\"Pass\",\"Fail\")))))","v":"N/A"},null,null,null,null,null,"Copayment",null,{"$f":"IF(OR(AX70=\"Fail\",AX70=\"N/A\"),AX70,MAX(tbl_OPAOINN_P2Cop[Predominant & Smaller]))","v":"N/A"},{"$f":"IF(AND(OR(AV63=\"\",AV63=\"N/A\"),AX70=\"N/A\"),\"N/A\",IF(AND(OR(AW63=\"N/A\",AW63=\"Fail\"),OR(AV63=\"N/A\",AV63=\"Not Applicable\")),\"Pass\",IF(AW63=\"Fail\",AW63,IF(AV63=\"\",\"Fail - Enter MHSUD cost share\",IF(AND(AW63<>\"N/A\",AW63<>\"Fail\",OR(AND(AV63<=AW63,AV63>=0),AV63=\"N/A\",AV63=\"Not Applicable\")),\"Pass\",\"Fail\")))))","v":"N/A"},null,null,null,null,null,"Copayment",null,{"$f":"IF(OR(BG70=\"Fail\",BG70=\"N/A\"),BG70,MAX(tbl_OPOON_P2Cop[Predominant & Smaller]))","v":"N/A"},{"$f":"IF(AND(OR(BE63=\"\",BE63=\"N/A\"),BG70=\"N/A\"),\"N/A\",IF(AND(OR(BF63=\"N/A\",BF63=\"Fail\"),OR(BE63=\"N/A\",BE63=\"Not Applicable\")),\"Pass\",IF(BF63=\"Fail\",BF63,IF(BE63=\"\",\"Fail - Enter MHSUD cost share\",IF(AND(BF63<>\"N/A\",BF63<>\"Fail\",OR(AND(BE63<=BF63,BE63>=0),BE63=\"N/A\",BE63=\"Not Applicable\")),\"Pass\",\"Fail\")))))","v":"N/A"},null,null,null,null,null,"Copayment",null,{"$f":"IF(OR(BP70=\"Fail\",BP70=\"N/A\"),BP70,MAX(tbl_OPOVOON_P2Cop[Predominant & Smaller]))","v":"N/A"},{"$f":"IF(AND(OR(BN63=\"\",BN63=\"N/A\"),BP70=\"N/A\"),\"N/A\",IF(AND(OR(BO63=\"N/A\",BO63=\"Fail\"),OR(BN63=\"N/A\",BN63=\"Not Applicable\")),\"Pass\",IF(BO63=\"Fail\",BO63,IF(BN63=\"\",\"Fail - Enter MHSUD cost share\",IF(AND(BO63<>\"N/A\",BO63<>\"Fail\",OR(AND(BN63<=BO63,BN63>=0),BN63=\"N/A\",BN63=\"Not Applicable\")),\"Pass\",\"Fail\")))))","v":"N/A"},null,null,null,null,null,"Copayment",null,{"$f":"IF(OR(BY70=\"Fail\",BY70=\"N/A\"),BY70,MAX(tbl_OPAOOON_P2Cop[Predominant & Smaller]))","v":"N/A"},{"$f":"IF(AND(OR(BW63=\"\",BW63=\"N/A\"),BY70=\"N/A\"),\"N/A\",IF(AND(OR(BX63=\"N/A\",BX63=\"Fail\"),OR(BW63=\"N/A\",BW63=\"Not Applicable\")),\"Pass\",IF(BX63=\"Fail\",BX63,IF(BW63=\"\",\"Fail - Enter MHSUD cost share\",IF(AND(BX63<>\"N/A\",BX63<>\"Fail\",OR(AND(BW63<=BX63,BW63>=0),BW63=\"N/A\",BW63=\"Not Applicable\")),\"Pass\",\"Fail\")))))","v":"N/A"},null,null,null,null,null,"Copayment",null,{"$f":"IF(OR(CH70=\"Fail\",CH70=\"N/A\"),CH70,MAX(tbl_ER_P2Cop[Predominant & Smaller]))","v":"Fail"},{"$f":"IF(AND(OR(CF63=\"\",CF63=\"N/A\"),CH70=\"N/A\"),\"N/A\",IF(AND(OR(CG63=\"N/A\",CG63=\"Fail\"),OR(CF63=\"N/A\",CF63=\"Not Applicable\")),\"Pass\",IF(CG63=\"Fail\",CG63,IF(CF63=\"\",\"Fail - Enter MHSUD cost share\",IF(AND(CG63<>\"N/A\",CG63<>\"Fail\",OR(AND(CF63<=CG63,CF63>=0),CF63=\"N/A\",CF63=\"Not Applicable\")),\"Pass\",\"Fail\")))))","v":"Fail"},null,null,null,null,null,"Copayment",null,{"$f":"IF(OR(CQ70=\"Fail\",CQ70=\"N/A\"),CQ70,MAX(tbl_RX_P2Cop[Predominant & Smaller]))","v":"Fail"},{"$f":"IF(AND(OR(CO63=\"\",CO63=\"N/A\"),CQ70=\"N/A\"),\"N/A\",IF(AND(OR(CP63=\"N/A\",CP63=\"Fail\"),OR(CO63=\"N/A\",CO63=\"Not Applicable\")),\"Pass\",IF(CP63=\"Fail\",CP63,IF(CO63=\"\",\"Fail - Enter MHSUD cost share\",IF(AND(CP63<>\"N/A\",CP63<>\"Fail\",OR(AND(CO63<=CP63,CO63>=0),CO63=\"N/A\",CO63=\"Not Applicable\")),\"Pass\",\"Fail\")))))","v":"Fail"}]
[null,null,null,null,null,null,null,null,null,null,"Coinsurance",null,{"$f":"IF(OR(N71=\"Fail\",N71=\"N/A\"),N71,MAX(tbl_IPINN_P2Coi[Predominant & Smaller]))","v":"Fail"},{"$f":"IF(AND(OR(L64=\"\",L64=\"N/A\"),N71=\"N/A\"),\"N/A\",IF(AND(OR(M64=\"N/A\",M64=\"Fail\"),OR(L64=\"N/A\",L64=\"Not Applicable\")),\"Pass\",IF(M64=\"Fail\",M64,IF(L64=\"\",\"Fail - Enter MHSUD cost share\",IF(AND(M64<>\"N/A\",M64<>\"Fail\",OR(AND(L64<=M64,L64>=0),L64=\"N/A\",L64=\"Not Applicable\")),\"Pass\",\"Fail\")))))","v":"Fail"},null,null,null,null,null,"Coinsurance",null,{"$f":"IF(OR(W71=\"Fail\",W71=\"N/A\"),W71,MAX(tbl_IPOON_P2Coi[Predominant & Smaller]))","v":"N/A"},"N/A",null,null,null,null,null,"Coinsurance",null,{"$f":"IF(OR(AF71=\"Fail\",AF71=\"N/A\"),AF71,MAX(tbl_OPINN_P2Coi[Predominant & Smaller]))","v":"N/A"},"N/A",null,null,null,null,null,"Coinsurance",null,{"$f":"IF(OR(AO71=\"Fail\",AO71=\"N/A\"),AO71,MAX(tbl_OPOVINN_P2Coi[Predominant & Smaller]))","v":"N/A"},"N/A",null,null,null,null,null,"Coinsurance",null,{"$f":"IF(OR(AX71=\"Fail\",AX71=\"N/A\"),AX71,MAX(tbl_OPAOINN_P2Coi[Predominant & Smaller]))","v":"N/A"},"N/A",null,null,null,null,null,"Coinsurance",null,{"$f":"IF(OR(BG71=\"Fail\",BG71=\"N/A\"),BG71,MAX(tbl_OPOON_P2Coi[Predominant & Smaller]))","v":"N/A"},"N/A",null,null,null,null,null,"Coinsurance",null,{"$f":"IF(OR(BP71=\"Fail\",BP71=\"N/A\"),BP71,MAX(tbl_OPOVOON_P2Coi[Predominant & Smaller]))","v":"N/A"},"N/A",null,null,null,null,null,"Coinsurance",null,{"$f":"IF(OR(BY71=\"Fail\",BY71=\"N/A\"),BY71,MAX(tbl_OPAOOON_P2Coi[Predominant & Smaller]))","v":"N/A"},"N/A",null,null,null,null,null,"Coinsurance",null,{"$f":"IF(OR(CH71=\"Fail\",CH71=\"N/A\"),CH71,MAX(tbl_ER_P2Coi[Predominant & Smaller]))","v":"Fail"},"Fail",null,null,null,null,null,"Coinsurance",null,{"$f":"IF(OR(CQ71=\"Fail\",CQ71=\"N/A\"),CQ71,MAX(tbl_RX_P2Coi[Predominant & Smaller]))","v":"Fail"},"Fail"]
[null,null,null,null,null,null,null,null,null,null,"OOPM",null,{"$f":"IF(OR(N72=\"Fail\",N72=\"N/A\"),N72,MAX(tbl_IPINN_P2OOPM[Predominant & Smaller]))","v":"Fail"},{"$f":"IF(AND(OR(L65=\"\",L65=\"N/A\"),N72=\"N/A\"),\"N/A\",IF(AND(OR(M65=\"N/A\",M65=\"Fail\"),OR(L65=\"N/A\",L65=\"Not Applicable\")),\"Pass\",IF(M65=\"Fail\",M65,IF(L65=\"\",\"Fail - Enter MHSUD cost share\",IF(AND(M65<>\"N/A\",M65<>\"Fail\",OR(AND(L65<=M65,L65>=0),L65=\"N/A\",L65=\"Not Applicable\")),\"Pass\",\"Fail\")))))","v":"Fail"},null,null,null,null,null,"OOPM",null,{"$f":"IF(OR(W72=\"Fail\",W72=\"N/A\"),W72,MAX(tbl_IPOON_P2OOPM[Predominant & Smaller]))","v":"N/A"},"N/A",null,null,null,null,null,"OOPM",null,{"$f":"IF(OR(AF72=\"Fail\",AF72=\"N/A\"),AF72,MAX(tbl_OPINN_P2OOPM[Predominant & Smaller]))","v":"N/A"},"N/A",null,null,null,null,null,"OOPM",null,{"$f":"IF(OR(AO72=\"Fail\",AO72=\"N/A\"),AO72,MAX(tbl_OPOVINN_P2OOPM[Predominant & Smaller]))","v":"N/A"},"N/A",null,null,null,null,null,"OOPM",null,{"$f":"IF(OR(AX72=\"Fail\",AX72=\"N/A\"),AX72,MAX(tbl_OPAOINN_P2OOPM[Predominant & Smaller]))","v":"N/A"},"N/A",null,null,null,null,null,"OOPM",null,{"$f":"IF(OR(BG72=\"Fail\",BG72=\"N/A\"),BG72,MAX(tbl_OPOON_P2OOPM[Predominant & Smaller]))","v":"N/A"},"N/A",null,null,null,null,null,"OOPM",null,{"$f":"IF(OR(BP72=\"Fail\",BP72=\"N/A\"),BP72,MAX(tbl_OPOVOON_P2OOPM[Predominant & Smaller]))","v":"N/A"},"N/A",null,null,null,null,null,"OOPM",null,{"$f":"IF(OR(BY72=\"Fail\",BY72=\"N/A\"),BY72,MAX(tbl_OPAOOON_P2OOPM[Predominant & Smaller]))","v":"N/A"},"N/A",null,null,null,null,null,"OOPM",null,{"$f":"IF(OR(CH72=\"Fail\",CH72=\"N/A\"),CH72,MAX(tbl_ER_P2OOPM[Predominant & Smaller]))","v":"Fail"},"Fail",null,null,null,null,null,"OOPM",null,{"$f":"IF(OR(CQ72=\"Fail\",CQ72=\"N/A\"),CQ72,MAX(tbl_RX_P2OOPM[Predominant & Smaller]))","v":"Fail"},"Fail"]
[null,null,null,null,null,null,null,null,null,null,"Overall",null,null,{"$f":"IF((COUNTIF(N62:N65,\"Pass\")+COUNTIF(N62:N65,\"N/A\"))=4,\"Pass\",\"Fail\")","v":"Fail"},null,null,null,null,null,"Overall",null,null,{"$f":"IF((COUNTIF(W62:W65,\"Pass\")+COUNTIF(W62:W65,\"N/A\"))=4,\"Pass\",\"Fail\")","v":"Pass"},null,null,null,null,null,"Overall",null,null,{"$f":"IF((COUNTIF(AF62:AF65,\"Pass\")+COUNTIF(AF62:AF65,\"N/A\"))=4,\"Pass\",\"Fail\")","v":"Pass"},null,null,null,null,null,"Overall",null,null,{"$f":"IF((COUNTIF(AO62:AO65,\"Pass\")+COUNTIF(AO62:AO65,\"N/A\"))=4,\"Pass\",\"Fail\")","v":"Pass"},null,null,null,null,null,"Overall",null,null,{"$f":"IF((COUNTIF(AX62:AX65,\"Pass\")+COUNTIF(AX62:AX65,\"N/A\"))=4,\"Pass\",\"Fail\")","v":"Pass"},null,null,null,null,null,"Overall",null,null,{"$f":"IF((COUNTIF(BG62:BG65,\"Pass\")+COUNTIF(BG62:BG65,\"N/A\"))=4,\"Pass\",\"Fail\")","v":"Pass"},null,null,null,null,null,"Overall",null,null,{"$f":"IF((COUNTIF(BP62:BP65,\"Pass\")+COUNTIF(BP62:BP65,\"N/A\"))=4,\"Pass\",\"Fail\")","v":"Pass"},null,null,null,null,null,"Overall",null,null,{"$f":"IF((COUNTIF(BY62:BY65,\"Pass\")+COUNTIF(BY62:BY65,\"N/A\"))=4,\"Pass\",\"Fail\")","v":"Pass"},null,null,null,null,null,"Overall",null,null,{"$f":"IF((COUNTIF(CH62:CH65,\"Pass\")+COUNTIF(CH62:CH65,\"N/A\"))=4,\"Pass\",\"Fail\")","v":"Fail"},null,null,null,null,null,"Overall",null,null,{"$f":"IF((COUNTIF(CQ62:CQ65,\"Pass\")+COUNTIF(CQ62:CQ65,\"N/A\"))=4,\"Pass\",\"Fail\")","v":"Fail"}]
[null,null,null,null,null,null,null,null,null,null,null,"*If not applicable, enter \"N/A\"",null,null,null,null,null,null,null,null,"*If not applicable, enter \"N/A\"",null,null,null,null,null,null,null,null,"*If not applicable, enter \"N/A\"",null,null,null,null,null,null,null,null,"*If not applicable, enter \"N/A\"",null,null,null,null,null,null,null,null,"*If not applicable, enter \"N/A\"",null,null,null,null,null,null,null,null,"*If not applicable, enter \"N/A\"",null,null,null,null,null,null,null,null,"*If not applicable, enter \"N/A\"",null,null,null,null,null,null,null,null,"*If not applicable, enter \"N/A\"",null,null,null,null,null,null,null,null,"*If not applicable, enter \"N/A\"",null,null,null,null,null,null,null,null,"*If not applicable, enter \"N/A\""]
[null,null,null,null,null,null,null,null,null,null,"Step 1 Substantially All (i.e., ≥ ⅔ of medical/surgical benefits)",null,null,null,null,null,null,null,null,"Step 1 Substantially All (i.e., ≥ ⅔ of medical/surgical benefits)",null,null,null,null,null,null,null,null,"Step 1 Substantially All (i.e., ≥ ⅔ of medical/surgical benefits)",null,null,null,null,null,null,null,null,"Step 1 Substantially All (i.e., ≥ ⅔ of medical/surgical benefits)",null,null,null,null,null,null,null,null,"Step 1 Substantially All (i.e., ≥ ⅔ of medical/surgical benefits)",null,null,null,null,null,null,null,null,"Step 1 Substantially All (i.e., ≥ ⅔ of medical/surgical benefits)",null,null,null,null,null,null,null,null,"Step 1 Substantially All (i.e., ≥ ⅔ of medical/surgical benefits)",null,null,null,null,null,null,null,null,"Step 1 Substantially All (i.e., ≥ ⅔ of medical/surgical benefits)",null,null,null,null,null,null,null,null,"Step 1 Substantially All (i.e., ≥ ⅔ of medical/surgical benefits)",null,null,null,null,null,null,null,null,"Step 1 Substantially All (i.e., ≥ ⅔ of medical/surgical benefits)"]
[null,null,null,null,null,null,null,null,null,null,"Deductible",{"$f":"SUMIF(tbl_IPINN_P1[Deductible],\">0\",tbl_IPINN_P1[Plan Projected Allowed Amount])","v":0},{"$f":"IFERROR(L69/L$73,\"\")","v":""},{"$f":"IF($D$28=\"Yes\",IF(L69=0,\"Fail\",IF(M69>=(2/3),M$45&\" \"&K69,\"Fail\")),\"N/A\")","v":"Fail"},null,null,null,null,null,"Deductible",{"$f":"SUMIF(tbl_IPOON_P1[Deductible],\">0\",tbl_IPOON_P1[Plan Projected Allowed Amount])","v":0},{"$f":"IFERROR(U69/U$73,\"\")","v":""},{"$f":"IF(AND($F$28=\"Yes\",$C$21=\"Yes\"),IF(U69=0,\"Fail\",IF(V69>=(2/3),V$45&\" \"&T69,\"Fail\")),\"N/A\")","v":"N/A"},null,null,null,null,null,"Deductible",{"$f":"SUMIF(tbl_OPINN_P1[Deductible],\">0\",tbl_OPINN_P1[Plan Projected Allowed Amount])","v":0},{"$f":"IFERROR(AD69/AD$73,\"\")","v":""},{"$f":"IF(AND($D$30=\"Yes\",$C$22=\"All Combined\"),IF(AD69=0,\"Fail\",IF(AE69>=(2/3),AE$45&\" \"&AC69,\"Fail\")),\"N/A\")","v":"N/A"},null,null,null,null,null,"Deductible",{"$f":"SUMIF(tbl_OPOVINN_P1[Deductible],\">0\",tbl_OPOVINN_P1[Plan Projected Allowed Amount])","v":0},{"$f":"IFERROR(AM69/AM$73,\"\")","v":""},{"$f":"IF(AND($D$32=\"Yes\",$C$22=\"Office Visits Separate\"),IF(AM69=0,\"Fail\",IF(AN69>=(2/3),AN$45&\" \"&AL69,\"Fail\")),\"N/A\")","v":"N/A"},null,null,null,null,null,"Deductible",{"$f":"SUMIF(tbl_OPAOINN_P1[Deductible],\">0\",tbl_OPAOINN_P1[Plan Projected Allowed Amount])","v":0},{"$f":"IFERROR(AV69/AV$73,\"\")","v":""},{"$f":"IF(AND($D$33=\"Yes\",$C$22=\"Office Visits Separate\"),IF(AV69=0,\"Fail\",IF(AW69>=(2/3),AW$45&\" \"&AU69,\"Fail\")),\"N/A\")","v":"N/A"},null,null,null,null,null,"Deductible",{"$f":"SUMIF(tbl_OPOON_P1[Deductible],\">0\",tbl_OPOON_P1[Plan Projected Allowed Amount])","v":0},{"$f":"IFERROR(BE69/BE$73,\"\")","v":""},{"$f":"IF(AND($F$30=\"Yes\",$C$22=\"All Combined\",$C$21=\"Yes\"),IF(BE69=0,\"Fail\",IF(BF69>=(2/3),BF$45&\" \"&BD69,\"Fail\")),\"N/A\")","v":"N/A"},null,null,null,null,null,"Deductible",{"$f":"SUMIF(tbl_OPOVOON_P1[Deductible],\">0\",tbl_OPOVOON_P1[Plan Projected Allowed Amount])","v":0},{"$f":"IFERROR(BN69/BN$73,\"\")","v":""},{"$f":"IF(AND($F$32=\"Yes\",$C$22=\"Office Visits Separate\",$C$21=\"Yes\"),IF(BN69=0,\"Fail\",IF(BO69>=(2/3),BO$45&\" \"&BM69,\"Fail\")),\"N/A\")","v":"N/A"},null,null,null,null,null,"Deductible",{"$f":"SUMIF(tbl_OPAOOON_P1[Deductible],\">0\",tbl_OPAOOON_P1[Plan Projected Allowed Amount])","v":0},{"$f":"IFERROR(BW69/BW$73,\"\")","v":""},{"$f":"IF(AND($F$33=\"Yes\",$C$22=\"Office Visits Separate\",$C$21=\"Yes\"),IF(BW69=0,\"Fail\",IF(BX69>=(2/3),BX$45&\" \"&BV69,\"Fail\")),\"N/A\")","v":"N/A"},null,null,null,null,null,"Deductible",{"$f":"SUMIF(tbl_ER_P1[Deductible],\">0\",tbl_ER_P1[Plan Projected Allowed Amount])","v":0},{"$f":"IFERROR(CF69/CF$73,\"\")","v":""},{"$f":"IF($D$36=\"Yes\",IF(CF69=0,\"Fail\",IF(CG69>=(2/3),CG$45&\" \"&CE69,\"Fail\")),\"N/A\")","v":"Fail"},null,null,null,null,null,"Deductible",{"$f":"SUMIF(tbl_RX_P1[Deductible],\">0\",tbl_RX_P1[Plan Projected Allowed Amount])","v":0},{"$f":"IFERROR(CO69/CO$73,\"\")","v":""},{"$f":"IF($D$37=\"Yes\",IF(CO69=0,\"Fail\",IF(CP69>=(2/3),CP$45&\" \"&CN69,\"Fail\")),\"N/A\")","v":"Fail"}]
[null,null,null,null,null,null,null,null,null,null,"Copayment",{"$f":"SUMIF(tbl_IPINN_P1[Copayment],\">0\",tbl_IPINN_P1[Plan Projected Allowed Amount])","v":0},{"$f":"IFERROR(L70/L$73,\"\")","v":""},{"$f":"IF($D$28=\"Yes\",IF(L70=0,\"Fail\",IF(M70>=(2/3),M$45&\" \"&K70,\"Fail\")),\"N/A\")","v":"Fail"},null,null,null,null,null,"Copayment",{"$f":"SUMIF(tbl_IPOON_P1[Copayment],\">0\",tbl_IPOON_P1[Plan Projected Allowed Amount])","v":0},{"$f":"IFERROR(U70/U$73,\"\")","v":""},{"$f":"IF(AND($F$28=\"Yes\",$C$21=\"Yes\"),IF(U70=0,\"Fail\",IF(V70>=(2/3),V$45&\" \"&T70,\"Fail\")),\"N/A\")","v":"N/A"},null,null,null,null,null,"Copayment",{"$f":"SUMIF(tbl_OPINN_P1[Copayment],\">0\",tbl_OPINN_P1[Plan Projected Allowed Amount])","v":0},{"$f":"IFERROR(AD70/AD$73,\"\")","v":""},{"$f":"IF(AND($D$30=\"Yes\",$C$22=\"All Combined\"),IF(AD70=0,\"Fail\",IF(AE70>=(2/3),AE$45&\" \"&AC70,\"Fail\")),\"N/A\")","v":"N/A"},null,null,null,null,null,"Copayment",{"$f":"SUMIF(tbl_OPOVINN_P1[Copayment],\">0\",tbl_OPOVINN_P1[Plan Projected Allowed Amount])","v":0},{"$f":"IFERROR(AM70/AM$73,\"\")","v":""},{"$f":"IF(AND($D$32=\"Yes\",$C$22=\"Office Visits Separate\"),IF(AM70=0,\"Fail\",IF(AN70>=(2/3),AN$45&\" \"&AL70,\"Fail\")),\"N/A\")","v":"N/A"},null,null,null,null,null,"Copayment",{"$f":"SUMIF(tbl_OPAOINN_P1[Copayment],\">0\",tbl_OPAOINN_P1[Plan Projected Allowed Amount])","v":0},{"$f":"IFERROR(AV70/AV$73,\"\")","v":""},{"$f":"IF(AND($D$33=\"Yes\",$C$22=\"Office Visits Separate\"),IF(AV70=0,\"Fail\",IF(AW70>=(2/3),AW$45&\" \"&AU70,\"Fail\")),\"N/A\")","v":"N/A"},null,null,null,null,null,"Copayment",{"$f":"SUMIF(tbl_OPOON_P1[Copayment],\">0\",tbl_OPOON_P1[Plan Projected Allowed Amount])","v":0},{"$f":"IFERROR(BE70/BE$73,\"\")","v":""},{"$f":"IF(AND($F$30=\"Yes\",$C$22=\"All Combined\",$C$21=\"Yes\"),IF(BE70=0,\"Fail\",IF(BF70>=(2/3),BF$45&\" \"&BD70,\"Fail\")),\"N/A\")","v":"N/A"},null,null,null,null,null,"Copayment",{"$f":"SUMIF(tbl_OPOVOON_P1[Copayment],\">0\",tbl_OPOVOON_P1[Plan Projected Allowed Amount])","v":0},{"$f":"IFERROR(BN70/BN$73,\"\")","v":""},{"$f":"IF(AND($F$32=\"Yes\",$C$22=\"Office Visits Separate\",$C$21=\"Yes\"),IF(BN70=0,\"Fail\",IF(BO70>=(2/3),BO$45&\" \"&BM70,\"Fail\")),\"N/A\")","v":"N/A"},null,null,null,null,null,"Copayment",{"$f":"SUMIF(tbl_OPAOOON_P1[Copayment],\">0\",tbl_OPAOOON_P1[Plan Projected Allowed Amount])","v":0},{"$f":"IFERROR(BW70/BW$73,\"\")","v":""},{"$f":"IF(AND($F$33=\"Yes\",$C$22=\"Office Visits Separate\",$C$21=\"Yes\"),IF(BW70=0,\"Fail\",IF(BX70>=(2/3),BX$45&\" \"&BV70,\"Fail\")),\"N/A\")","v":"N/A"},null,null,null,null,null,"Copayment",{"$f":"SUMIF(tbl_ER_P1[Copayment],\">0\",tbl_ER_P1[Plan Projected Allowed Amount])","v":0},{"$f":"IFERROR(CF70/CF$73,\"\")","v":""},{"$f":"IF($D$36=\"Yes\",IF(CF70=0,\"Fail\",IF(CG70>=(2/3),CG$45&\" \"&CE70,\"Fail\")),\"N/A\")","v":"Fail"},null,null,null,null,null,"Copayment",{"$f":"SUMIF(tbl_RX_P1[Copayment],\">0\",tbl_RX_P1[Plan Projected Allowed Amount])","v":0},{"$f":"IFERROR(CO70/CO$73,\"\")","v":""},{"$f":"IF($D$37=\"Yes\",IF(CO70=0,\"Fail\",IF(CP70>=(2/3),CP$45&\" \"&CN70,\"Fail\")),\"N/A\")","v":"Fail"}]
[null,null,null,null,null,null,null,null,null,null,"Coinsurance",{"$f":"SUMIF(tbl_IPINN_P1[Coinsurance],\">0\",tbl_IPINN_P1[Plan Projected Allowed Amount])","v":0},{"$f":"IFERROR(L71/L$73,\"\")","v":""},{"$f":"IF($D$28=\"Yes\",IF(L71=0,\"Fail\",IF(M71>=(2/3),M$45&\" \"&K71,\"Fail\")),\"N/A\")","v":"Fail"},null,null,null,null,null,"Coinsurance",{"$f":"SUMIF(tbl_IPOON_P1[Coinsurance],\">0\",tbl_IPOON_P1[Plan Projected Allowed Amount])","v":0},{"$f":"IFERROR(U71/U$73,\"\")","v":""},{"$f":"IF(AND($F$28=\"Yes\",$C$21=\"Yes\"),IF(U71=0,\"Fail\",IF(V71>=(2/3),V$45&\" \"&T71,\"Fail\")),\"N/A\")","v":"N/A"},null,null,null,null,null,"Coinsurance",{"$f":"SUMIF(tbl_OPINN_P1[Coinsurance],\">0\",tbl_OPINN_P1[Plan Projected Allowed Amount])","v":0},{"$f":"IFERROR(AD71/AD$73,\"\")","v":""},{"$f":"IF(AND($D$30=\"Yes\",$C$22=\"All Combined\"),IF(AD71=0,\"Fail\",IF(AE71>=(2/3),AE$45&\" \"&AC71,\"Fail\")),\"N/A\")","v":"N/A"},null,null,null,null,null,"Coinsurance",{"$f":"SUMIF(tbl_OPOVINN_P1[Coinsurance],\">0\",tbl_OPOVINN_P1[Plan Projected Allowed Amount])","v":0},{"$f":"IFERROR(AM71/AM$73,\"\")","v":""},{"$f":"IF(AND($D$32=\"Yes\",$C$22=\"Office Visits Separate\"),IF(AM71=0,\"Fail\",IF(AN71>=(2/3),AN$45&\" \"&AL71,\"Fail\")),\"N/A\")","v":"N/A"},null,null,null,null,null,"Coinsurance",{"$f":"SUMIF(tbl_OPAOINN_P1[Coinsurance],\">0\",tbl_OPAOINN_P1[Plan Projected Allowed Amount])","v":0},{"$f":"IFERROR(AV71/AV$73,\"\")","v":""},{"$f":"IF(AND($D$33=\"Yes\",$C$22=\"Office Visits Separate\"),IF(AV71=0,\"Fail\",IF(AW71>=(2/3),AW$45&\" \"&AU71,\"Fail\")),\"N/A\")","v":"N/A"},null,null,null,null,null,"Coinsurance",{"$f":"SUMIF(tbl_OPOON_P1[Coinsurance],\">0\",tbl_OPOON_P1[Plan Projected Allowed Amount])","v":0},{"$f":"IFERROR(BE71/BE$73,\"\")","v":""},{"$f":"IF(AND($F$30=\"Yes\",$C$22=\"All Combined\",$C$21=\"Yes\"),IF(BE71=0,\"Fail\",IF(BF71>=(2/3),BF$45&\" \"&BD71,\"Fail\")),\"N/A\")","v":"N/A"},null,null,null,null,null,"Coinsurance",{"$f":"SUMIF(tbl_OPOVOON_P1[Coinsurance],\">0\",tbl_OPOVOON_P1[Plan Projected Allowed Amount])","v":0},{"$f":"IFERROR(BN71/BN$73,\"\")","v":""},{"$f":"IF(AND($F$32=\"Yes\",$C$22=\"Office Visits Separate\",$C$21=\"Yes\"),IF(BN71=0,\"Fail\",IF(BO71>=(2/3),BO$45&\" \"&BM71,\"Fail\")),\"N/A\")","v":"N/A"},null,null,null,null,null,"Coinsurance",{"$f":"SUMIF(tbl_OPAOOON_P1[Coinsurance],\">0\",tbl_OPAOOON_P1[Plan Projected Allowed Amount])","v":0},{"$f":"IFERROR(BW71/BW$73,\"\")","v":""},{"$f":"IF(AND($F$33=\"Yes\",$C$22=\"Office Visits Separate\",$C$21=\"Yes\"),IF(BW71=0,\"Fail\",IF(BX71>=(2/3),BX$45&\" \"&BV71,\"Fail\")),\"N/A\")","v":"N/A"},null,null,null,null,null,"Coinsurance",{"$f":"SUMIF(tbl_ER_P1[Coinsurance],\">0\",tbl_ER_P1[Plan Projected Allowed Amount])","v":0},{"$f":"IFERROR(CF71/CF$73,\"\")","v":""},{"$f":"IF($D$36=\"Yes\",IF(CF71=0,\"Fail\",IF(CG71>=(2/3),CG$45&\" \"&CE71,\"Fail\")),\"N/A\")","v":"Fail"},null,null,null,null,null,"Coinsurance",{"$f":"SUMIF(tbl_RX_P1[Coinsurance],\">0\",tbl_RX_P1[Plan Projected Allowed Amount])","v":0},{"$f":"IFERROR(CO71/CO$73,\"\")","v":""},{"$f":"IF($D$37=\"Yes\",IF(CO71=0,\"Fail\",IF(CP71>=(2/3),CP$45&\" \"&CN71,\"Fail\")),\"N/A\")","v":"Fail"}]
[null,null,null,null,null,null,null,null,null,null,"OOPM",{"$f":"SUMIF(tbl_IPINN_P1[Out-of-Pocket Maximum (OOPM)],\">0\",tbl_IPINN_P1[Plan Projected Allowed Amount])","v":0},{"$f":"IFERROR(L72/L$73,\"\")","v":""},{"$f":"IF($D$28=\"Yes\",IF(L72=0,\"Fail\",IF(M72>=(2/3),M$45&\" \"&K72,\"Fail\")),\"N/A\")","v":"Fail"},null,null,null,null,null,"OOPM",{"$f":"SUMIF(tbl_IPOON_P1[Out-of-Pocket Maximum (OOPM)],\">0\",tbl_IPOON_P1[Plan Projected Allowed Amount])","v":0},{"$f":"IFERROR(U72/U$73,\"\")","v":""},{"$f":"IF(AND($F$28=\"Yes\",$C$21=\"Yes\"),IF(U72=0,\"Fail\",IF(V72>=(2/3),V$45&\" \"&T72,\"Fail\")),\"N/A\")","v":"N/A"},null,null,null,null,null,"OOPM",{"$f":"SUMIF(tbl_OPINN_P1[Out-of-Pocket Maximum (OOPM)],\">0\",tbl_OPINN_P1[Plan Projected Allowed Amount])","v":0},{"$f":"IFERROR(AD72/AD$73,\"\")","v":""},{"$f":"IF(AND($D$30=\"Yes\",$C$22=\"All Combined\"),IF(AD72=0,\"Fail\",IF(AE72>=(2/3),AE$45&\" \"&AC72,\"Fail\")),\"N/A\")","v":"N/A"},null,null,null,null,null,"OOPM",{"$f":"SUMIF(tbl_OPOVINN_P1[Out-of-Pocket Maximum (OOPM)],\">0\",tbl_OPOVINN_P1[Plan Projected Allowed Amount])","v":0},{"$f":"IFERROR(AM72/AM$73,\"\")","v":""},{"$f":"IF(AND($D$32=\"Yes\",$C$22=\"Office Visits Separate\"),IF(AM72=0,\"Fail\",IF(AN72>=(2/3),AN$45&\" \"&AL72,\"Fail\")),\"N/A\")","v":"N/A"},null,null,null,null,null,"OOPM",{"$f":"SUMIF(tbl_OPAOINN_P1[Out-of-Pocket Maximum (OOPM)],\">0\",tbl_OPAOINN_P1[Plan Projected Allowed Amount])","v":0},{"$f":"IFERROR(AV72/AV$73,\"\")","v":""},{"$f":"IF(AND($D$33=\"Yes\",$C$22=\"Office Visits Separate\"),IF(AV72=0,\"Fail\",IF(AW72>=(2/3),AW$45&\" \"&AU72,\"Fail\")),\"N/A\")","v":"N/A"},null,null,null,null,null,"OOPM",{"$f":"SUMIF(tbl_OPOON_P1[Out-of-Pocket Maximum (OOPM)],\">0\",tbl_OPOON_P1[Plan Projected Allowed Amount])","v":0},{"$f":"IFERROR(BE72/BE$73,\"\")","v":""},{"$f":"IF(AND($F$30=\"Yes\",$C$22=\"All Combined\",$C$21=\"Yes\"),IF(BE72=0,\"Fail\",IF(BF72>=(2/3),BF$45&\" \"&BD72,\"Fail\")),\"N/A\")","v":"N/A"},null,null,null,null,null,"OOPM",{"$f":"SUMIF(tbl_OPOVOON_P1[Out-of-Pocket Maximum (OOPM)],\">0\",tbl_OPOVOON_P1[Plan Projected Allowed Amount])","v":0},{"$f":"IFERROR(BN72/BN$73,\"\")","v":""},{"$f":"IF(AND($F$32=\"Yes\",$C$22=\"Office Visits Separate\",$C$21=\"Yes\"),IF(BN72=0,\"Fail\",IF(BO72>=(2/3),BO$45&\" \"&BM72,\"Fail\")),\"N/A\")","v":"N/A"},null,null,null,null,null,"OOPM",{"$f":"SUMIF(tbl_OPAOOON_P1[Out-of-Pocket Maximum (OOPM)],\">0\",tbl_OPAOOON_P1[Plan Projected Allowed Amount])","v":0},{"$f":"IFERROR(BW72/BW$73,\"\")","v":""},{"$f":"IF(AND($F$33=\"Yes\",$C$22=\"Office Visits Separate\",$C$21=\"Yes\"),IF(BW72=0,\"Fail\",IF(BX72>=(2/3),BX$45&\" \"&BV72,\"Fail\")),\"N/A\")","v":"N/A"},null,null,null,null,null,"OOPM",{"$f":"SUMIF(tbl_ER_P1[Out-of-Pocket Maximum (OOPM)],\">0\",tbl_ER_P1[Plan Projected Allowed Amount])","v":0},{"$f":"IFERROR(CF72/CF$73,\"\")","v":""},{"$f":"IF($D$36=\"Yes\",IF(CF72=0,\"Fail\",IF(CG72>=(2/3),CG$45&\" \"&CE72,\"Fail\")),\"N/A\")","v":"Fail"},null,null,null,null,null,"OOPM",{"$f":"SUMIF(tbl_RX_P1[Out-of-Pocket Maximum (OOPM)],\">0\",tbl_RX_P1[Plan Projected Allowed Amount])","v":0},{"$f":"IFERROR(CO72/CO$73,\"\")","v":""},{"$f":"IF($D$37=\"Yes\",IF(CO72=0,\"Fail\",IF(CP72>=(2/3),CP$45&\" \"&CN72,\"Fail\")),\"N/A\")","v":"Fail"}]
[null,null,null,null,null,null,null,null,null,null,"Total Projected",{"$f":"tbl_IPINN_P1[[#Totals],[Plan Projected Allowed Amount]]","v":0},null,null,null,null,null,null,null,"Total Projected",{"$f":"tbl_IPOON_P1[[#Totals],[Plan Projected Allowed Amount]]","v":0},null,null,null,null,null,null,null,"Total Projected",{"$f":"tbl_OPINN_P1[[#Totals],[Plan Projected Allowed Amount]]","v":0},null,null,null,null,null,null,null,"Total Projected",{"$f":"tbl_OPOVINN_P1[[#Totals],[Plan Projected Allowed Amount]]","v":0},null,null,null,null,null,null,null,"Total Projected",{"$f":"tbl_OPAOINN_P1[[#Totals],[Plan Projected Allowed Amount]]","v":0},null,null,null,null,null,null,null,"Total Projected",{"$f":"tbl_OPOON_P1[[#Totals],[Plan Projected Allowed Amount]]","v":0},null,null,null,null,null,null,null,"Total Projected",{"$f":"tbl_OPOVOON_P1[[#Totals],[Plan Projected Allowed Amount]]","v":0},null,null,null,null,null,null,null,"Total Projected",{"$f":"tbl_OPAOOON_P1[[#Totals],[Plan Projected Allowed Amount]]","v":0},null,null,null,null,null,null,null,"Total Projected",{"$f":"tbl_ER_P1[[#Totals],[Plan Projected Allowed Amount]]","v":0},null,null,null,null,null,null,null,"Total Projected",{"$f":"tbl_RX_P1[[#Totals],[Plan Projected Allowed Amount]]","v":0}]
[]
[null,null,null,null,null,null,null,null,null,null,"Step 2 Predominant Level",null,null,null,null,null,null,null,null,"Step 2 Predominant Level",null,null,null,null,null,null,null,null,"Step 2 Predominant Level",null,null,null,null,null,null,null,null,"Step 2 Predominant Level",null,null,null,null,null,null,null,null,"Step 2 Predominant Level",null,null,null,null,null,null,null,null,"Step 2 Predominant Level",null,null,null,null,null,null,null,null,"Step 2 Predominant Level",null,null,null,null,null,null,null,null,"Step 2 Predominant Level",null,null,null,null,null,null,null,null,"Step 2 Predominant Level",null,null,null,null,null,null,null,null,"Step 2 Predominant Level"]
[null,null,null,null,null,null,null,null,null,null,{"$f":"K80&\" ---- \"&L$40","v":"Deductible ---- (1) Inpatient, In-Network (IP INN)"},null,null,"Errors found:",{"$f":"COUNTIF(tbl_IPINN_P2Ded[[#Data],[#Totals],[Error Checking]],\"?*\")","v":0},null,null,null,null,{"$f":"T80&\" ---- \"&U$40","v":"Deductible ---- (2) Inpatient, Out-of-Network (IP OON)"},null,null,"Errors found:",{"$f":"COUNTIF(tbl_IPOON_P2Ded[[#Data],[#Totals],[Error Checking]],\"?*\")","v":0},null,null,null,null,{"$f":"AC80&\" ---- \"&AD$40","v":"Deductible ---- (3) Outpatient, In-Network (OP INN)"},null,null,"Errors found:",{"$f":"COUNTIF(tbl_OPINN_P2Ded[[#Data],[#Totals],[Error Checking]],\"?*\")","v":0},null,null,null,null,{"$f":"AL80&\" ---- \"&AM$40","v":"Deductible ---- (3a) Outpatient - Office Visits, In-Network (OP-OV INN)"},null,null,"Errors found:",{"$f":"COUNTIF(tbl_OPOVINN_P2Ded[[#Data],[#Totals],[Error Checking]],\"?*\")","v":0},null,null,null,null,{"$f":"AU80&\" ---- \"&AV$40","v":"Deductible ---- (3b) Outpatient - All Other, In-Network (OP-AO INN)"},null,null,"Errors found:",{"$f":"COUNTIF(tbl_OPAOINN_P2Ded[[#Data],[#Totals],[Error Checking]],\"?*\")","v":0},null,null,null,null,{"$f":"BD80&\" ---- \"&BE$40","v":"Deductible ---- (4) Outpatient, Out-of-Network (OP OON)"},null,null,"Errors found:",{"$f":"COUNTIF(tbl_OPOON_P2Ded[[#Data],[#Totals],[Error Checking]],\"?*\")","v":0},null,null,null,null,{"$f":"BM80&\" ---- \"&BN$40","v":"Deductible ---- (4a) Outpatient - Office Visits, Out-of-Network (OP-OV OON)"},null,null,"Errors found:",{"$f":"COUNTIF(tbl_OPOVOON_P2Ded[[#Data],[#Totals],[Error Checking]],\"?*\")","v":0},null,null,null,null,{"$f":"BV80&\" ---- \"&BW$40","v":"Deductible ---- (4b) Outpatient - All Other, Out-of-Network (OP-AO OON)"},null,null,"Errors found:",{"$f":"COUNTIF(tbl_OPAOOON_P2Ded[[#Data],[#Totals],[Error Checking]],\"?*\")","v":0},null,null,null,null,{"$f":"CE80&\" ---- \"&CF$40","v":"Deductible ---- (5) Emergency Care,  (ER )"},null,null,"Errors found:",{"$f":"COUNTIF(tbl_ER_P2Ded[[#Data],[#Totals],[Error Checking]],\"?*\")","v":0},null,null,null,null,{"$f":"CN80&\" ---- \"&CO$40","v":"Deductible ---- (6) Prescription Drugs,  (RX )"},null,null,"Errors found:",{"$f":"COUNTIF(tbl_RX_P2Ded[[#Data],[#Totals],[Error Checking]],\"?*\")","v":0}]
[null,null,null,null,null,null,null,null,null,null,{"$f":"IF(INDEX(M$69:M$72,MATCH(K80,K$69:K$72,0))=\"\",\"If testing is required for this benefit classification: \nPlease ensure each different cost-share combination is entered above in PART 1.\",IF(INDEX(M$69:M$72,MATCH(K80,K$69:K$72,0))>=(2/3),\"Applies to substantially all medical/surgical benefits in this classification.\nENTER different \"&LOWER(K80)&\" amounts from smallest to largest.\",\"Does not apply to substantially all medical/surgical benefits in this classification. \nDELETE any values in the left-hand column below.\"))","v":"If testing is required for this benefit classification: \nPlease ensure each different cost-share combination is entered above in PART 1."},null,null,null,null,null,null,null,null,{"$f":"IF(INDEX(V$69:V$72,MATCH(T80,T$69:T$72,0))=\"\",\"If testing is required for this benefit classification: \nPlease ensure each different cost-share combination is entered above in PART 1.\",IF(INDEX(V$69:V$72,MATCH(T80,T$69:T$72,0))>=(2/3),\"Applies to substantially all medical/surgical benefits in this classification.\nENTER different \"&LOWER(T80)&\" amounts from smallest to largest.\",\"Does not apply to substantially all medical/surgical benefits in this classification. \nDELETE any values in the left-hand column below.\"))","v":"If testing is required for this benefit classification: \nPlease ensure each different cost-share combination is entered above in PART 1."},null,null,null,null,null,null,null,null,{"$f":"IF(INDEX(AE$69:AE$72,MATCH(AC80,AC$69:AC$72,0))=\"\",\"If testing is required for this benefit classification: \nPlease ensure each different cost-share combination is entered above in PART 1.\",IF(INDEX(AE$69:AE$72,MATCH(AC80,AC$69:AC$72,0))>=(2/3),\"Applies to substantially all medical/surgical benefits in this classification.\nENTER different \"&LOWER(AC80)&\" amounts from smallest to largest.\",\"Does not apply to substantially all medical/surgical benefits in this classification. \nDELETE any values in the left-hand column below.\"))","v":"If testing is required for this benefit classification: \nPlease ensure each different cost-share combination is entered above in PART 1."},null,null,null,null,null,null,null,null,{"$f":"IF(INDEX(AN$69:AN$72,MATCH(AL80,AL$69:AL$72,0))=\"\",\"If testing is required for this benefit classification: \nPlease ensure each different cost-share combination is entered above in PART 1.\",IF(INDEX(AN$69:AN$72,MATCH(AL80,AL$69:AL$72,0))>=(2/3),\"Applies to substantially all medical/surgical benefits in this classification.\nENTER different \"&LOWER(AL80)&\" amounts from smallest to largest.\",\"Does not apply to substantially all medical/surgical benefits in this classification. \nDELETE any values in the left-hand column below.\"))","v":"If testing is required for this benefit classification: \nPlease ensure each different cost-share combination is entered above in PART 1."},null,null,null,null,null,null,null,null,{"$f":"IF(INDEX(AW$69:AW$72,MATCH(AU80,AU$69:AU$72,0))=\"\",\"If testing is required for this benefit classification: \nPlease ensure each different cost-share combination is entered above in PART 1.\",IF(INDEX(AW$69:AW$72,MATCH(AU80,AU$69:AU$72,0))>=(2/3),\"Applies to substantially all medical/surgical benefits in this classification.\nENTER different \"&LOWER(AU80)&\" amounts from smallest to largest.\",\"Does not apply to substantially all medical/surgical benefits in this classification. \nDELETE any values in the left-hand column below.\"))","v":"If testing is required for this benefit classification: \nPlease ensure each different cost-share combination is entered above in PART 1."},null,null,null,null,null,null,null,null,{"$f":"IF(INDEX(BF$69:BF$72,MATCH(BD80,BD$69:BD$72,0))=\"\",\"If testing is required for this benefit classification: \nPlease ensure each different cost-share combination is entered above in PART 1.\",IF(INDEX(BF$69:BF$72,MATCH(BD80,BD$69:BD$72,0))>=(2/3),\"Applies to substantially all medical/surgical benefits in this classification.\nENTER different \"&LOWER(BD80)&\" amounts from smallest to largest.\",\"Does not apply to substantially all medical/surgical benefits in this classification. \nDELETE any values in the left-hand column below.\"))","v":"If testing is required for this benefit classification: \nPlease ensure each different cost-share combination is entered above in PART 1."},null,null,null,null,null,null,null,null,{"$f":"IF(INDEX(BO$69:BO$72,MATCH(BM80,BM$69:BM$72,0))=\"\",\"If testing is required for this benefit classification: \nPlease ensure each different cost-share combination is entered above in PART 1.\",IF(INDEX(BO$69:BO$72,MATCH(BM80,BM$69:BM$72,0))>=(2/3),\"Applies to substantially all medical/surgical benefits in this classification.\nENTER different \"&LOWER(BM80)&\" amounts from smallest to largest.\",\"Does not apply to substantially all medical/surgical benefits in this classification. \nDELETE any values in the left-hand column below.\"))","v":"If testing is required for this benefit classification: \nPlease ensure each different cost-share combination is entered above in PART 1."},null,null,null,null,null,null,null,null,{"$f":"IF(INDEX(BX$69:BX$72,MATCH(BV80,BV$69:BV$72,0))=\"\",\"If testing is required for this benefit classification: \nPlease ensure each different cost-share combination is entered above in PART 1.\",IF(INDEX(BX$69:BX$72,MATCH(BV80,BV$69:BV$72,0))>=(2/3),\"Applies to substantially all medical/surgical benefits in this classification.\nENTER different \"&LOWER(BV80)&\" amounts from smallest to largest.\",\"Does not apply to substantially all medical/surgical benefits in this classification. \nDELETE any values in the left-hand column below.\"))","v":"If testing is required for this benefit classification: \nPlease ensure each different cost-share combination is entered above in PART 1."},null,null,null,null,null,null,null,null,{"$f":"IF(INDEX(CG$69:CG$72,MATCH(CE80,CE$69:CE$72,0))=\"\",\"If testing is required for this benefit classification: \nPlease ensure each different cost-share combination is entered above in PART 1.\",IF(INDEX(CG$69:CG$72,MATCH(CE80,CE$69:CE$72,0))>=(2/3),\"Applies to substantially all medical/surgical benefits in this classification.\nENTER different \"&LOWER(CE80)&\" amounts from smallest to largest.\",\"Does not apply to substantially all medical/surgical benefits in this classification. \nDELETE any values in the left-hand column below.\"))","v":"If testing is required for this benefit classification: \nPlease ensure each different cost-share combination is entered above in PART 1."},null,null,null,null,null,null,null,null,{"$f":"IF(INDEX(CP$69:CP$72,MATCH(CN80,CN$69:CN$72,0))=\"\",\"If testing is required for this benefit classification: \nPlease ensure each different cost-share combination is entered above in PART 1.\",IF(INDEX(CP$69:CP$72,MATCH(CN80,CN$69:CN$72,0))>=(2/3),\"Applies to substantially all medical/surgical benefits in this classification.\nENTER different \"&LOWER(CN80)&\" amounts from smallest to largest.\",\"Does not apply to substantially all medical/surgical benefits in this classification. \nDELETE any values in the left-hand column below.\"))","v":"If testing is required for this benefit classification: \nPlease ensure each different cost-share combination is entered above in PART 1."}]
[]
[]
[null,null,null,null,null,null,null,null,null,null,"Deductible","Allowed Claims","Portion","Predominant & Smaller","Error Checking",null,null,null,null,"Deductible","Allowed Claims","Portion","Predominant & Smaller","Error Checking",null,null,null,null,"Deductible","Allowed Claims","Portion","Predominant & Smaller","Error Checking",null,null,null,null,"Deductible","Allowed Claims","Portion","Predominant & Smaller","Error Checking",null,null,null,null,"Deductible","Allowed Claims","Portion","Predominant & Smaller","Error Checking",null,null,null,null,"Deductible","Allowed Claims","Portion","Predominant & Smaller","Error Checking",null,null,null,null,"Deductible","Allowed Claims","Portion","Predominant & Smaller","Error Checking",null,null,null,null,"Deductible","Allowed Claims","Portion","Predominant & Smaller","Error Checking",null,null,null,null,"Deductible","Allowed Claims","Portion","Predominant & Smaller","Error Checking",null,null,null,null,"Deductible","Allowed Claims","Portion","Predominant & Smaller","Error Checking"]
[null,null,null,null,null,null,null,null,null,null,null,{"$f":"SUMIF(tbl_IPINN_P1[Deductible],K81,tbl_IPINN_P1[Plan Projected Allowed Amount])","v":0},{"$f":"IF(OR(L81=0,L81=\"\"),\"\",L81/tbl_IPINN_P2Ded[[#Totals],[Allowed Claims]])","v":""},{"$f":"IF(M81=\"\",\"\",IF(SUMIF(tbl_IPINN_P2Ded[Deductible],\">=\"&K81,tbl_IPINN_P2Ded[Portion])>0.5,K81,\"\"))","v":""},{"$f":"IF(COUNTIF(tbl_IPINN_P2Ded[Deductible],tbl_IPINN_P2Ded[[#This Row],[Deductible]])>1,\"Remove Duplicate Entry.\",IF(AND(tbl_IPINN_P2Ded[[#This Row],[Deductible]]<>\"\",tbl_IPINN_P2Ded[[#This Row],[Allowed Claims]]=0),\"Entry not found in Part 1 Table\",IF(AND(OFFSET(tbl_IPINN_P2Ded[[#This Row],[Deductible]],1,0)<>\"Total\",OFFSET(tbl_IPINN_P2Ded[[#This Row],[Deductible]],1,0)<>\"\",OFFSET(tbl_IPINN_P2Ded[[#This Row],[Deductible]],1,0)<tbl_IPINN_P2Ded[[#This Row],[Deductible]]),\"Sort Entries from lowest to highest\",\"\")))","v":""},null,null,null,null,null,{"$f":"SUMIF(tbl_IPOON_P1[Deductible],T81,tbl_IPOON_P1[Plan Projected Allowed Amount])","v":0},{"$f":"IF(OR(U81=0,U81=\"\"),\"\",U81/tbl_IPOON_P2Ded[[#Totals],[Allowed Claims]])","v":""},{"$f":"IF(V81=\"\",\"\",IF(SUMIF(tbl_IPOON_P2Ded[Deductible],\">=\"&T81,tbl_IPOON_P2Ded[Portion])>0.5,T81,\"\"))","v":""},{"$f":"IF(COUNTIF(tbl_IPOON_P2Ded[Deductible],tbl_IPOON_P2Ded[[#This Row],[Deductible]])>1,\"Remove Duplicate Entry.\",IF(AND(tbl_IPOON_P2Ded[[#This Row],[Deductible]]<>\"\",tbl_IPOON_P2Ded[[#This Row],[Allowed Claims]]=0),\"Entry not found in Part 1 Table\",IF(AND(OFFSET(tbl_IPOON_P2Ded[[#This Row],[Deductible]],1,0)<>\"Total\",OFFSET(tbl_IPOON_P2Ded[[#This Row],[Deductible]],1,0)<>\"\",OFFSET(tbl_IPOON_P2Ded[[#This Row],[Deductible]],1,0)<tbl_IPOON_P2Ded[[#This Row],[Deductible]]),\"Sort Entries from lowest to highest\",\"\")))","v":""},null,null,null,null,null,{"$f":"SUMIF(tbl_OPINN_P1[Deductible],AC81,tbl_OPINN_P1[Plan Projected Allowed Amount])","v":0},{"$f":"IF(OR(AD81=0,AD81=\"\"),\"\",AD81/tbl_OPINN_P2Ded[[#Totals],[Allowed Claims]])","v":""},{"$f":"IF(AE81=\"\",\"\",IF(SUMIF(tbl_OPINN_P2Ded[Deductible],\">=\"&AC81,tbl_OPINN_P2Ded[Portion])>0.5,AC81,\"\"))","v":""},{"$f":"IF(COUNTIF(tbl_OPINN_P2Ded[Deductible],tbl_OPINN_P2Ded[[#This Row],[Deductible]])>1,\"Remove Duplicate Entry.\",IF(AND(tbl_OPINN_P2Ded[[#This Row],[Deductible]]<>\"\",tbl_OPINN_P2Ded[[#This Row],[Allowed Claims]]=0),\"Entry not found in Part 1 Table\",IF(AND(OFFSET(tbl_OPINN_P2Ded[[#This Row],[Deductible]],1,0)<>\"Total\",OFFSET(tbl_OPINN_P2Ded[[#This Row],[Deductible]],1,0)<>\"\",OFFSET(tbl_OPINN_P2Ded[[#This Row],[Deductible]],1,0)<tbl_OPINN_P2Ded[[#This Row],[Deductible]]),\"Sort Entries from lowest to highest\",\"\")))","v":""},null,null,null,null,null,{"$f":"SUMIF(tbl_OPOVINN_P1[Deductible],AL81,tbl_OPOVINN_P1[Plan Projected Allowed Amount])","v":0},{"$f":"IF(OR(AM81=0,AM81=\"\"),\"\",AM81/tbl_OPOVINN_P2Ded[[#Totals],[Allowed Claims]])","v":""},{"$f":"IF(AN81=\"\",\"\",IF(SUMIF(tbl_OPOVINN_P2Ded[Deductible],\">=\"&AL81,tbl_OPOVINN_P2Ded[Portion])>0.5,AL81,\"\"))","v":""},{"$f":"IF(COUNTIF(tbl_OPOVINN_P2Ded[Deductible],tbl_OPOVINN_P2Ded[[#This Row],[Deductible]])>1,\"Remove Duplicate Entry.\",IF(AND(tbl_OPOVINN_P2Ded[[#This Row],[Deductible]]<>\"\",tbl_OPOVINN_P2Ded[[#This Row],[Allowed Claims]]=0),\"Entry not found in Part 1 Table\",IF(AND(OFFSET(tbl_OPOVINN_P2Ded[[#This Row],[Deductible]],1,0)<>\"Total\",OFFSET(tbl_OPOVINN_P2Ded[[#This Row],[Deductible]],1,0)<>\"\",OFFSET(tbl_OPOVINN_P2Ded[[#This Row],[Deductible]],1,0)<tbl_OPOVINN_P2Ded[[#This Row],[Deductible]]),\"Sort Entries from lowest to highest\",\"\")))","v":""},null,null,null,null,null,{"$f":"SUMIF(tbl_OPAOINN_P1[Deductible],AU81,tbl_OPAOINN_P1[Plan Projected Allowed Amount])","v":0},{"$f":"IF(OR(AV81=0,AV81=\"\"),\"\",AV81/tbl_OPAOINN_P2Ded[[#Totals],[Allowed Claims]])","v":""},{"$f":"IF(AW81=\"\",\"\",IF(SUMIF(tbl_OPAOINN_P2Ded[Deductible],\">=\"&AU81,tbl_OPAOINN_P2Ded[Portion])>0.5,AU81,\"\"))","v":""},{"$f":"IF(COUNTIF(tbl_OPAOINN_P2Ded[Deductible],tbl_OPAOINN_P2Ded[[#This Row],[Deductible]])>1,\"Remove Duplicate Entry.\",IF(AND(tbl_OPAOINN_P2Ded[[#This Row],[Deductible]]<>\"\",tbl_OPAOINN_P2Ded[[#This Row],[Allowed Claims]]=0),\"Entry not found in Part 1 Table\",IF(AND(OFFSET(tbl_OPAOINN_P2Ded[[#This Row],[Deductible]],1,0)<>\"Total\",OFFSET(tbl_OPAOINN_P2Ded[[#This Row],[Deductible]],1,0)<>\"\",OFFSET(tbl_OPAOINN_P2Ded[[#This Row],[Deductible]],1,0)<tbl_OPAOINN_P2Ded[[#This Row],[Deductible]]),\"Sort Entries from lowest to highest\",\"\")))","v":""},null,null,null,null,null,{"$f":"SUMIF(tbl_OPOON_P1[Deductible],BD81,tbl_OPOON_P1[Plan Projected Allowed Amount])","v":0},{"$f":"IF(OR(BE81=0,BE81=\"\"),\"\",BE81/tbl_OPOON_P2Ded[[#Totals],[Allowed Claims]])","v":""},{"$f":"IF(BF81=\"\",\"\",IF(SUMIF(tbl_OPOON_P2Ded[Deductible],\">=\"&BD81,tbl_OPOON_P2Ded[Portion])>0.5,BD81,\"\"))","v":""},{"$f":"IF(COUNTIF(tbl_OPOON_P2Ded[Deductible],tbl_OPOON_P2Ded[[#This Row],[Deductible]])>1,\"Remove Duplicate Entry.\",IF(AND(tbl_OPOON_P2Ded[[#This Row],[Deductible]]<>\"\",tbl_OPOON_P2Ded[[#This Row],[Allowed Claims]]=0),\"Entry not found in Part 1 Table\",IF(AND(OFFSET(tbl_OPOON_P2Ded[[#This Row],[Deductible]],1,0)<>\"Total\",OFFSET(tbl_OPOON_P2Ded[[#This Row],[Deductible]],1,0)<>\"\",OFFSET(tbl_OPOON_P2Ded[[#This Row],[Deductible]],1,0)<tbl_OPOON_P2Ded[[#This Row],[Deductible]]),\"Sort Entries from lowest to highest\",\"\")))","v":""},null,null,null,null,null,{"$f":"SUMIF(tbl_OPOVOON_P1[Deductible],BM81,tbl_OPOVOON_P1[Plan Projected Allowed Amount])","v":0},{"$f":"IF(OR(BN81=0,BN81=\"\"),\"\",BN81/tbl_OPOVOON_P2Ded[[#Totals],[Allowed Claims]])","v":""},{"$f":"IF(BO81=\"\",\"\",IF(SUMIF(tbl_OPOVOON_P2Ded[Deductible],\">=\"&BM81,tbl_OPOVOON_P2Ded[Portion])>0.5,BM81,\"\"))","v":""},{"$f":"IF(COUNTIF(tbl_OPOVOON_P2Ded[Deductible],tbl_OPOVOON_P2Ded[[#This Row],[Deductible]])>1,\"Remove Duplicate Entry.\",IF(AND(tbl_OPOVOON_P2Ded[[#This Row],[Deductible]]<>\"\",tbl_OPOVOON_P2Ded[[#This Row],[Allowed Claims]]=0),\"Entry not found in Part 1 Table\",IF(AND(OFFSET(tbl_OPOVOON_P2Ded[[#This Row],[Deductible]],1,0)<>\"Total\",OFFSET(tbl_OPOVOON_P2Ded[[#This Row],[Deductible]],1,0)<>\"\",OFFSET(tbl_OPOVOON_P2Ded[[#This Row],[Deductible]],1,0)<tbl_OPOVOON_P2Ded[[#This Row],[Deductible]]),\"Sort Entries from lowest to highest\",\"\")))","v":""},null,null,null,null,null,{"$f":"SUMIF(tbl_OPAOOON_P1[Deductible],BV81,tbl_OPAOOON_P1[Plan Projected Allowed Amount])","v":0},{"$f":"IF(OR(BW81=0,BW81=\"\"),\"\",BW81/tbl_OPAOOON_P2Ded[[#Totals],[Allowed Claims]])","v":""},{"$f":"IF(BX81=\"\",\"\",IF(SUMIF(tbl_OPAOOON_P2Ded[Deductible],\">=\"&BV81,tbl_OPAOOON_P2Ded[Portion])>0.5,BV81,\"\"))","v":""},{"$f":"IF(COUNTIF(tbl_OPAOOON_P2Ded[Deductible],tbl_OPAOOON_P2Ded[[#This Row],[Deductible]])>1,\"Remove Duplicate Entry.\",IF(AND(tbl_OPAOOON_P2Ded[[#This Row],[Deductible]]<>\"\",tbl_OPAOOON_P2Ded[[#This Row],[Allowed Claims]]=0),\"Entry not found in Part 1 Table\",IF(AND(OFFSET(tbl_OPAOOON_P2Ded[[#This Row],[Deductible]],1,0)<>\"Total\",OFFSET(tbl_OPAOOON_P2Ded[[#This Row],[Deductible]],1,0)<>\"\",OFFSET(tbl_OPAOOON_P2Ded[[#This Row],[Deductible]],1,0)<tbl_OPAOOON_P2Ded[[#This Row],[Deductible]]),\"Sort Entries from lowest to highest\",\"\")))","v":""},null,null,null,null,null,{"$f":"SUMIF(tbl_ER_P1[Deductible],CE81,tbl_ER_P1[Plan Projected Allowed Amount])","v":0},{"$f":"IF(OR(CF81=0,CF81=\"\"),\"\",CF81/tbl_ER_P2Ded[[#Totals],[Allowed Claims]])","v":""},{"$f":"IF(CG81=\"\",\"\",IF(SUMIF(tbl_ER_P2Ded[Deductible],\">=\"&CE81,tbl_ER_P2Ded[Portion])>0.5,CE81,\"\"))","v":""},{"$f":"IF(COUNTIF(tbl_ER_P2Ded[Deductible],tbl_ER_P2Ded[[#This Row],[Deductible]])>1,\"Remove Duplicate Entry.\",IF(AND(tbl_ER_P2Ded[[#This Row],[Deductible]]<>\"\",tbl_ER_P2Ded[[#This Row],[Allowed Claims]]=0),\"Entry not found in Part 1 Table\",IF(AND(OFFSET(tbl_ER_P2Ded[[#This Row],[Deductible]],1,0)<>\"Total\",OFFSET(tbl_ER_P2Ded[[#This Row],[Deductible]],1,0)<>\"\",OFFSET(tbl_ER_P2Ded[[#This Row],[Deductible]],1,0)<tbl_ER_P2Ded[[#This Row],[Deductible]]),\"Sort Entries from lowest to highest\",\"\")))","v":""},null,null,null,null,null,{"$f":"SUMIF(tbl_RX_P1[Deductible],CN81,tbl_RX_P1[Plan Projected Allowed Amount])","v":0},{"$f":"IF(OR(CO81=0,CO81=\"\"),\"\",CO81/tbl_RX_P2Ded[[#Totals],[Allowed Claims]])","v":""},{"$f":"IF(CP81=\"\",\"\",IF(SUMIF(tbl_RX_P2Ded[Deductible],\">=\"&CN81,tbl_RX_P2Ded[Portion])>0.5,CN81,\"\"))","v":""},{"$f":"IF(COUNTIF(tbl_RX_P2Ded[Deductible],tbl_RX_P2Ded[[#This Row],[Deductible]])>1,\"Remove Duplicate Entry.\",IF(AND(tbl_RX_P2Ded[[#This Row],[Deductible]]<>\"\",tbl_RX_P2Ded[[#This Row],[Allowed Claims]]=0),\"Entry not found in Part 1 Table\",IF(AND(OFFSET(tbl_RX_P2Ded[[#This Row],[Deductible]],1,0)<>\"Total\",OFFSET(tbl_RX_P2Ded[[#This Row],[Deductible]],1,0)<>\"\",OFFSET(tbl_RX_P2Ded[[#This Row],[Deductible]],1,0)<tbl_RX_P2Ded[[#This Row],[Deductible]]),\"Sort Entries from lowest to highest\",\"\")))","v":""}]
[null,null,null,null,null,null,null,null,null,null,null,{"$f":"SUMIF(tbl_IPINN_P1[Deductible],K82,tbl_IPINN_P1[Plan Projected Allowed Amount])","v":0},{"$f":"IF(OR(L82=0,L82=\"\"),\"\",L82/tbl_IPINN_P2Ded[[#Totals],[Allowed Claims]])","v":""},{"$f":"IF(M82=\"\",\"\",IF(SUMIF(tbl_IPINN_P2Ded[Deductible],\">=\"&K82,tbl_IPINN_P2Ded[Portion])>0.5,K82,\"\"))","v":""},{"$f":"IF(COUNTIF(tbl_IPINN_P2Ded[Deductible],tbl_IPINN_P2Ded[[#This Row],[Deductible]])>1,\"Remove Duplicate Entry.\",IF(AND(tbl_IPINN_P2Ded[[#This Row],[Deductible]]<>\"\",tbl_IPINN_P2Ded[[#This Row],[Allowed Claims]]=0),\"Entry not found in Part 1 Table\",IF(AND(OFFSET(tbl_IPINN_P2Ded[[#This Row],[Deductible]],1,0)<>\"Total\",OFFSET(tbl_IPINN_P2Ded[[#This Row],[Deductible]],1,0)<>\"\",OFFSET(tbl_IPINN_P2Ded[[#This Row],[Deductible]],1,0)<tbl_IPINN_P2Ded[[#This Row],[Deductible]]),\"Sort Entries from lowest to highest\",\"\")))","v":""},null,null,null,null,null,{"$f":"SUMIF(tbl_IPOON_P1[Deductible],T82,tbl_IPOON_P1[Plan Projected Allowed Amount])","v":0},{"$f":"IF(OR(U82=0,U82=\"\"),\"\",U82/tbl_IPOON_P2Ded[[#Totals],[Allowed Claims]])","v":""},{"$f":"IF(V82=\"\",\"\",IF(SUMIF(tbl_IPOON_P2Ded[Deductible],\">=\"&T82,tbl_IPOON_P2Ded[Portion])>0.5,T82,\"\"))","v":""},{"$f":"IF(COUNTIF(tbl_IPOON_P2Ded[Deductible],tbl_IPOON_P2Ded[[#This Row],[Deductible]])>1,\"Remove Duplicate Entry.\",IF(AND(tbl_IPOON_P2Ded[[#This Row],[Deductible]]<>\"\",tbl_IPOON_P2Ded[[#This Row],[Allowed Claims]]=0),\"Entry not found in Part 1 Table\",IF(AND(OFFSET(tbl_IPOON_P2Ded[[#This Row],[Deductible]],1,0)<>\"Total\",OFFSET(tbl_IPOON_P2Ded[[#This Row],[Deductible]],1,0)<>\"\",OFFSET(tbl_IPOON_P2Ded[[#This Row],[Deductible]],1,0)<tbl_IPOON_P2Ded[[#This Row],[Deductible]]),\"Sort Entries from lowest to highest\",\"\")))","v":""},null,null,null,null,null,{"$f":"SUMIF(tbl_OPINN_P1[Deductible],AC82,tbl_OPINN_P1[Plan Projected Allowed Amount])","v":0},{"$f":"IF(OR(AD82=0,AD82=\"\"),\"\",AD82/tbl_OPINN_P2Ded[[#Totals],[Allowed Claims]])","v":""},{"$f":"IF(AE82=\"\",\"\",IF(SUMIF(tbl_OPINN_P2Ded[Deductible],\">=\"&AC82,tbl_OPINN_P2Ded[Portion])>0.5,AC82,\"\"))","v":""},{"$f":"IF(COUNTIF(tbl_OPINN_P2Ded[Deductible],tbl_OPINN_P2Ded[[#This Row],[Deductible]])>1,\"Remove Duplicate Entry.\",IF(AND(tbl_OPINN_P2Ded[[#This Row],[Deductible]]<>\"\",tbl_OPINN_P2Ded[[#This Row],[Allowed Claims]]=0),\"Entry not found in Part 1 Table\",IF(AND(OFFSET(tbl_OPINN_P2Ded[[#This Row],[Deductible]],1,0)<>\"Total\",OFFSET(tbl_OPINN_P2Ded[[#This Row],[Deductible]],1,0)<>\"\",OFFSET(tbl_OPINN_P2Ded[[#This Row],[Deductible]],1,0)<tbl_OPINN_P2Ded[[#This Row],[Deductible]]),\"Sort Entries from lowest to highest\",\"\")))","v":""},null,null,null,null,null,{"$f":"SUMIF(tbl_OPOVINN_P1[Deductible],AL82,tbl_OPOVINN_P1[Plan Projected Allowed Amount])","v":0},{"$f":"IF(OR(AM82=0,AM82=\"\"),\"\",AM82/tbl_OPOVINN_P2Ded[[#Totals],[Allowed Claims]])","v":""},{"$f":"IF(AN82=\"\",\"\",IF(SUMIF(tbl_OPOVINN_P2Ded[Deductible],\">=\"&AL82,tbl_OPOVINN_P2Ded[Portion])>0.5,AL82,\"\"))","v":""},{"$f":"IF(COUNTIF(tbl_OPOVINN_P2Ded[Deductible],tbl_OPOVINN_P2Ded[[#This Row],[Deductible]])>1,\"Remove Duplicate Entry.\",IF(AND(tbl_OPOVINN_P2Ded[[#This Row],[Deductible]]<>\"\",tbl_OPOVINN_P2Ded[[#This Row],[Allowed Claims]]=0),\"Entry not found in Part 1 Table\",IF(AND(OFFSET(tbl_OPOVINN_P2Ded[[#This Row],[Deductible]],1,0)<>\"Total\",OFFSET(tbl_OPOVINN_P2Ded[[#This Row],[Deductible]],1,0)<>\"\",OFFSET(tbl_OPOVINN_P2Ded[[#This Row],[Deductible]],1,0)<tbl_OPOVINN_P2Ded[[#This Row],[Deductible]]),\"Sort Entries from lowest to highest\",\"\")))","v":""},null,null,null,null,null,{"$f":"SUMIF(tbl_OPAOINN_P1[Deductible],AU82,tbl_OPAOINN_P1[Plan Projected Allowed Amount])","v":0},{"$f":"IF(OR(AV82=0,AV82=\"\"),\"\",AV82/tbl_OPAOINN_P2Ded[[#Totals],[Allowed Claims]])","v":""},{"$f":"IF(AW82=\"\",\"\",IF(SUMIF(tbl_OPAOINN_P2Ded[Deductible],\">=\"&AU82,tbl_OPAOINN_P2Ded[Portion])>0.5,AU82,\"\"))","v":""},{"$f":"IF(COUNTIF(tbl_OPAOINN_P2Ded[Deductible],tbl_OPAOINN_P2Ded[[#This Row],[Deductible]])>1,\"Remove Duplicate Entry.\",IF(AND(tbl_OPAOINN_P2Ded[[#This Row],[Deductible]]<>\"\",tbl_OPAOINN_P2Ded[[#This Row],[Allowed Claims]]=0),\"Entry not found in Part 1 Table\",IF(AND(OFFSET(tbl_OPAOINN_P2Ded[[#This Row],[Deductible]],1,0)<>\"Total\",OFFSET(tbl_OPAOINN_P2Ded[[#This Row],[Deductible]],1,0)<>\"\",OFFSET(tbl_OPAOINN_P2Ded[[#This Row],[Deductible]],1,0)<tbl_OPAOINN_P2Ded[[#This Row],[Deductible]]),\"Sort Entries from lowest to highest\",\"\")))","v":""},null,null,null,null,null,{"$f":"SUMIF(tbl_OPOON_P1[Deductible],BD82,tbl_OPOON_P1[Plan Projected Allowed Amount])","v":0},{"$f":"IF(OR(BE82=0,BE82=\"\"),\"\",BE82/tbl_OPOON_P2Ded[[#Totals],[Allowed Claims]])","v":""},{"$f":"IF(BF82=\"\",\"\",IF(SUMIF(tbl_OPOON_P2Ded[Deductible],\">=\"&BD82,tbl_OPOON_P2Ded[Portion])>0.5,BD82,\"\"))","v":""},{"$f":"IF(COUNTIF(tbl_OPOON_P2Ded[Deductible],tbl_OPOON_P2Ded[[#This Row],[Deductible]])>1,\"Remove Duplicate Entry.\",IF(AND(tbl_OPOON_P2Ded[[#This Row],[Deductible]]<>\"\",tbl_OPOON_P2Ded[[#This Row],[Allowed Claims]]=0),\"Entry not found in Part 1 Table\",IF(AND(OFFSET(tbl_OPOON_P2Ded[[#This Row],[Deductible]],1,0)<>\"Total\",OFFSET(tbl_OPOON_P2Ded[[#This Row],[Deductible]],1,0)<>\"\",OFFSET(tbl_OPOON_P2Ded[[#This Row],[Deductible]],1,0)<tbl_OPOON_P2Ded[[#This Row],[Deductible]]),\"Sort Entries from lowest to highest\",\"\")))","v":""},null,null,null,null,null,{"$f":"SUMIF(tbl_OPOVOON_P1[Deductible],BM82,tbl_OPOVOON_P1[Plan Projected Allowed Amount])","v":0},{"$f":"IF(OR(BN82=0,BN82=\"\"),\"\",BN82/tbl_OPOVOON_P2Ded[[#Totals],[Allowed Claims]])","v":""},{"$f":"IF(BO82=\"\",\"\",IF(SUMIF(tbl_OPOVOON_P2Ded[Deductible],\">=\"&BM82,tbl_OPOVOON_P2Ded[Portion])>0.5,BM82,\"\"))","v":""},{"$f":"IF(COUNTIF(tbl_OPOVOON_P2Ded[Deductible],tbl_OPOVOON_P2Ded[[#This Row],[Deductible]])>1,\"Remove Duplicate Entry.\",IF(AND(tbl_OPOVOON_P2Ded[[#This Row],[Deductible]]<>\"\",tbl_OPOVOON_P2Ded[[#This Row],[Allowed Claims]]=0),\"Entry not found in Part 1 Table\",IF(AND(OFFSET(tbl_OPOVOON_P2Ded[[#This Row],[Deductible]],1,0)<>\"Total\",OFFSET(tbl_OPOVOON_P2Ded[[#This Row],[Deductible]],1,0)<>\"\",OFFSET(tbl_OPOVOON_P2Ded[[#This Row],[Deductible]],1,0)<tbl_OPOVOON_P2Ded[[#This Row],[Deductible]]),\"Sort Entries from lowest to highest\",\"\")))","v":""},null,null,null,null,null,{"$f":"SUMIF(tbl_OPAOOON_P1[Deductible],BV82,tbl_OPAOOON_P1[Plan Projected Allowed Amount])","v":0},{"$f":"IF(OR(BW82=0,BW82=\"\"),\"\",BW82/tbl_OPAOOON_P2Ded[[#Totals],[Allowed Claims]])","v":""},{"$f":"IF(BX82=\"\",\"\",IF(SUMIF(tbl_OPAOOON_P2Ded[Deductible],\">=\"&BV82,tbl_OPAOOON_P2Ded[Portion])>0.5,BV82,\"\"))","v":""},{"$f":"IF(COUNTIF(tbl_OPAOOON_P2Ded[Deductible],tbl_OPAOOON_P2Ded[[#This Row],[Deductible]])>1,\"Remove Duplicate Entry.\",IF(AND(tbl_OPAOOON_P2Ded[[#This Row],[Deductible]]<>\"\",tbl_OPAOOON_P2Ded[[#This Row],[Allowed Claims]]=0),\"Entry not found in Part 1 Table\",IF(AND(OFFSET(tbl_OPAOOON_P2Ded[[#This Row],[Deductible]],1,0)<>\"Total\",OFFSET(tbl_OPAOOON_P2Ded[[#This Row],[Deductible]],1,0)<>\"\",OFFSET(tbl_OPAOOON_P2Ded[[#This Row],[Deductible]],1,0)<tbl_OPAOOON_P2Ded[[#This Row],[Deductible]]),\"Sort Entries from lowest to highest\",\"\")))","v":""},null,null,null,null,null,{"$f":"SUMIF(tbl_ER_P1[Deductible],CE82,tbl_ER_P1[Plan Projected Allowed Amount])","v":0},{"$f":"IF(OR(CF82=0,CF82=\"\"),\"\",CF82/tbl_ER_P2Ded[[#Totals],[Allowed Claims]])","v":""},{"$f":"IF(CG82=\"\",\"\",IF(SUMIF(tbl_ER_P2Ded[Deductible],\">=\"&CE82,tbl_ER_P2Ded[Portion])>0.5,CE82,\"\"))","v":""},{"$f":"IF(COUNTIF(tbl_ER_P2Ded[Deductible],tbl_ER_P2Ded[[#This Row],[Deductible]])>1,\"Remove Duplicate Entry.\",IF(AND(tbl_ER_P2Ded[[#This Row],[Deductible]]<>\"\",tbl_ER_P2Ded[[#This Row],[Allowed Claims]]=0),\"Entry not found in Part 1 Table\",IF(AND(OFFSET(tbl_ER_P2Ded[[#This Row],[Deductible]],1,0)<>\"Total\",OFFSET(tbl_ER_P2Ded[[#This Row],[Deductible]],1,0)<>\"\",OFFSET(tbl_ER_P2Ded[[#This Row],[Deductible]],1,0)<tbl_ER_P2Ded[[#This Row],[Deductible]]),\"Sort Entries from lowest to highest\",\"\")))","v":""},null,null,null,null,null,{"$f":"SUMIF(tbl_RX_P1[Deductible],CN82,tbl_RX_P1[Plan Projected Allowed Amount])","v":0},{"$f":"IF(OR(CO82=0,CO82=\"\"),\"\",CO82/tbl_RX_P2Ded[[#Totals],[Allowed Claims]])","v":""},{"$f":"IF(CP82=\"\",\"\",IF(SUMIF(tbl_RX_P2Ded[Deductible],\">=\"&CN82,tbl_RX_P2Ded[Portion])>0.5,CN82,\"\"))","v":""},{"$f":"IF(COUNTIF(tbl_RX_P2Ded[Deductible],tbl_RX_P2Ded[[#This Row],[Deductible]])>1,\"Remove Duplicate Entry.\",IF(AND(tbl_RX_P2Ded[[#This Row],[Deductible]]<>\"\",tbl_RX_P2Ded[[#This Row],[Allowed Claims]]=0),\"Entry not found in Part 1 Table\",IF(AND(OFFSET(tbl_RX_P2Ded[[#This Row],[Deductible]],1,0)<>\"Total\",OFFSET(tbl_RX_P2Ded[[#This Row],[Deductible]],1,0)<>\"\",OFFSET(tbl_RX_P2Ded[[#This Row],[Deductible]],1,0)<tbl_RX_P2Ded[[#This Row],[Deductible]]),\"Sort Entries from lowest to highest\",\"\")))","v":""}]
[null,null,null,null,null,null,null,null,null,null,"Total",{"$f":"SUBTOTAL(109,tbl_IPINN_P2Ded[Allowed Claims])","v":0},{"$f":"SUBTOTAL(109,tbl_IPINN_P2Ded[Portion])","v":0},null,{"$f":"IF(AND(tbl_IPINN_P2Ded[[#Totals],[Allowed Claims]]<L69,N69<>\"Fail\",N69<>\"N/A\"),\"Add missing cost share values.\",IF(L83>M55,\"Delete extra row or edit deductible values.\",\"\"))","v":""},null,null,null,null,"Total",{"$f":"SUBTOTAL(109,tbl_IPOON_P2Ded[Allowed Claims])","v":0},{"$f":"SUBTOTAL(109,tbl_IPOON_P2Ded[Portion])","v":0},null,{"$f":"IF(AND(tbl_IPOON_P2Ded[[#Totals],[Allowed Claims]]<U69,W69<>\"Fail\",W69<>\"N/A\"),\"Add missing cost share values.\",IF(U83>V55,\"Delete extra row or edit deductible values.\",\"\"))","v":""},null,null,null,null,"Total",{"$f":"SUBTOTAL(109,tbl_OPINN_P2Ded[Allowed Claims])","v":0},{"$f":"SUBTOTAL(109,tbl_OPINN_P2Ded[Portion])","v":0},null,{"$f":"IF(AND(tbl_OPINN_P2Ded[[#Totals],[Allowed Claims]]<AD69,AF69<>\"Fail\",AF69<>\"N/A\"),\"Add missing cost share values.\",IF(AD83>AE55,\"Delete extra row or edit deductible values.\",\"\"))","v":""},null,null,null,null,"Total",{"$f":"SUBTOTAL(109,tbl_OPOVINN_P2Ded[Allowed Claims])","v":0},{"$f":"SUBTOTAL(109,tbl_OPOVINN_P2Ded[Portion])","v":0},null,{"$f":"IF(AND(tbl_OPOVINN_P2Ded[[#Totals],[Allowed Claims]]<AM69,AO69<>\"Fail\",AO69<>\"N/A\"),\"Add missing cost share values.\",IF(AM83>AN55,\"Delete extra row or edit deductible values.\",\"\"))","v":""},null,null,null,null,"Total",{"$f":"SUBTOTAL(109,tbl_OPAOINN_P2Ded[Allowed Claims])","v":0},{"$f":"SUBTOTAL(109,tbl_OPAOINN_P2Ded[Portion])","v":0},null,{"$f":"IF(AND(tbl_OPAOINN_P2Ded[[#Totals],[Allowed Claims]]<AV69,AX69<>\"Fail\",AX69<>\"N/A\"),\"Add missing cost share values.\",IF(AV83>AW55,\"Delete extra row or edit deductible values.\",\"\"))","v":""},null,null,null,null,"Total",{"$f":"SUBTOTAL(109,tbl_OPOON_P2Ded[Allowed Claims])","v":0},{"$f":"SUBTOTAL(109,tbl_OPOON_P2Ded[Portion])","v":0},null,{"$f":"IF(AND(tbl_OPOON_P2Ded[[#Totals],[Allowed Claims]]<BE69,BG69<>\"Fail\",BG69<>\"N/A\"),\"Add missing cost share values.\",IF(BE83>BF55,\"Delete extra row or edit deductible values.\",\"\"))","v":""},null,null,null,null,"Total",{"$f":"SUBTOTAL(109,tbl_OPOVOON_P2Ded[Allowed Claims])","v":0},{"$f":"SUBTOTAL(109,tbl_OPOVOON_P2Ded[Portion])","v":0},null,{"$f":"IF(AND(tbl_OPOVOON_P2Ded[[#Totals],[Allowed Claims]]<BN69,BP69<>\"Fail\",BP69<>\"N/A\"),\"Add missing cost share values.\",IF(BN83>BO55,\"Delete extra row or edit deductible values.\",\"\"))","v":""},null,null,null,null,"Total",{"$f":"SUBTOTAL(109,tbl_OPAOOON_P2Ded[Allowed Claims])","v":0},{"$f":"SUBTOTAL(109,tbl_OPAOOON_P2Ded[Portion])","v":0},null,{"$f":"IF(AND(tbl_OPAOOON_P2Ded[[#Totals],[Allowed Claims]]<BW69,BY69<>\"Fail\",BY69<>\"N/A\"),\"Add missing cost share values.\",IF(BW83>BX55,\"Delete extra row or edit deductible values.\",\"\"))","v":""},null,null,null,null,"Total",{"$f":"SUBTOTAL(109,tbl_ER_P2Ded[Allowed Claims])","v":0},{"$f":"SUBTOTAL(109,tbl_ER_P2Ded[Portion])","v":0},null,{"$f":"IF(AND(tbl_ER_P2Ded[[#Totals],[Allowed Claims]]<CF69,CH69<>\"Fail\",CH69<>\"N/A\"),\"Add missing cost share values.\",IF(CF83>CG55,\"Delete extra row or edit deductible values.\",\"\"))","v":""},null,null,null,null,"Total",{"$f":"SUBTOTAL(109,tbl_RX_P2Ded[Allowed Claims])","v":0},{"$f":"SUBTOTAL(109,tbl_RX_P2Ded[Portion])","v":0},null,{"$f":"IF(AND(tbl_RX_P2Ded[[#Totals],[Allowed Claims]]<CO69,CQ69<>\"Fail\",CQ69<>\"N/A\"),\"Add missing cost share values.\",IF(CO83>CP55,\"Delete extra row or edit deductible values.\",\"\"))","v":""}]
[]
[null,null,null,null,null,null,null,null,null,null,{"$f":"K89&\" ---- \"&L$40","v":"Copayment ---- (1) Inpatient, In-Network (IP INN)"},null,null,"Errors found:",{"$f":"COUNTIF(tbl_IPINN_P2Cop[[#Data],[#Totals],[Error Checking]],\"?*\")","v":0},null,null,null,null,{"$f":"T89&\" ---- \"&U$40","v":"Copayment ---- (2) Inpatient, Out-of-Network (IP OON)"},null,null,"Errors found:",{"$f":"COUNTIF(tbl_IPOON_P2Cop[[#Data],[#Totals],[Error Checking]],\"?*\")","v":0},null,null,null,null,{"$f":"AC89&\" ---- \"&AD$40","v":"Copayment ---- (3) Outpatient, In-Network (OP INN)"},null,null,"Errors found:",{"$f":"COUNTIF(tbl_OPINN_P2Cop[[#Data],[#Totals],[Error Checking]],\"?*\")","v":0},null,null,null,null,{"$f":"AL89&\" ---- \"&AM$40","v":"Copayment ---- (3a) Outpatient - Office Visits, In-Network (OP-OV INN)"},null,null,"Errors found:",{"$f":"COUNTIF(tbl_OPOVINN_P2Cop[[#Data],[#Totals],[Error Checking]],\"?*\")","v":0},null,null,null,null,{"$f":"AU89&\" ---- \"&AV$40","v":"Copayment ---- (3b) Outpatient - All Other, In-Network (OP-AO INN)"},null,null,"Errors found:",{"$f":"COUNTIF(tbl_OPAOINN_P2Cop[[#Data],[#Totals],[Error Checking]],\"?*\")","v":0},null,null,null,null,{"$f":"BD89&\" ---- \"&BE$40","v":"Copayment ---- (4) Outpatient, Out-of-Network (OP OON)"},null,null,"Errors found:",{"$f":"COUNTIF(tbl_OPOON_P2Cop[[#Data],[#Totals],[Error Checking]],\"?*\")","v":0},null,null,null,null,{"$f":"BM89&\" ---- \"&BN$40","v":"Copayment ---- (4a) Outpatient - Office Visits, Out-of-Network (OP-OV OON)"},null,null,"Errors found:",{"$f":"COUNTIF(tbl_OPOVOON_P2Cop[[#Data],[#Totals],[Error Checking]],\"?*\")","v":0},null,null,null,null,{"$f":"BV89&\" ---- \"&BW$40","v":"Copayment ---- (4b) Outpatient - All Other, Out-of-Network (OP-AO OON)"},null,null,"Errors found:",{"$f":"COUNTIF(tbl_OPAOOON_P2Cop[[#Data],[#Totals],[Error Checking]],\"?*\")","v":0},null,null,null,null,{"$f":"CE89&\" ---- \"&CF$40","v":"Copayment ---- (5) Emergency Care,  (ER )"},null,null,"Errors found:",{"$f":"COUNTIF(tbl_ER_P2Cop[[#Data],[#Totals],[Error Checking]],\"?*\")","v":0},null,null,null,null,{"$f":"CN89&\" ---- \"&CO$40","v":"Copayment ---- (6) Prescription Drugs,  (RX )"},null,null,"Errors found:",{"$f":"COUNTIF(tbl_RX_P2Cop[[#Data],[#Totals],[Error Checking]],\"?*\")","v":0}]
[null,null,null,null,null,null,null,null,null,null,{"$f":"IF(INDEX(M$69:M$72,MATCH(K89,K$69:K$72,0))=\"\",\"If testing is required for this benefit classification: \nPlease ensure each different cost-share combination is entered above in PART 1.\",IF(INDEX(M$69:M$72,MATCH(K89,K$69:K$72,0))>=(2/3),\"Applies to substantially all medical/surgical benefits in this classification.\nENTER different \"&LOWER(K89)&\" amounts from smallest to largest.\",\"Does not apply to substantially all medical/surgical benefits in this classification. \nDELETE any values in the left-hand column below.\"))","v":"If testing is required for this benefit classification: \nPlease ensure each different cost-share combination is entered above in PART 1."},null,null,null,null,null,null,null,null,{"$f":"IF(INDEX(V$69:V$72,MATCH(T89,T$69:T$72,0))=\"\",\"If testing is required for this benefit classification: \nPlease ensure each different cost-share combination is entered above in PART 1.\",IF(INDEX(V$69:V$72,MATCH(T89,T$69:T$72,0))>=(2/3),\"Applies to substantially all medical/surgical benefits in this classification.\nENTER different \"&LOWER(T89)&\" amounts from smallest to largest.\",\"Does not apply to substantially all medical/surgical benefits in this classification. \nDELETE any values in the left-hand column below.\"))","v":"If testing is required for this benefit classification: \nPlease ensure each different cost-share combination is entered above in PART 1."},null,null,null,null,null,null,null,null,{"$f":"IF(INDEX(AE$69:AE$72,MATCH(AC89,AC$69:AC$72,0))=\"\",\"If testing is required for this benefit classification: \nPlease ensure each different cost-share combination is entered above in PART 1.\",IF(INDEX(AE$69:AE$72,MATCH(AC89,AC$69:AC$72,0))>=(2/3),\"Applies to substantially all medical/surgical benefits in this classification.\nENTER different \"&LOWER(AC89)&\" amounts from smallest to largest.\",\"Does not apply to substantially all medical/surgical benefits in this classification. \nDELETE any values in the left-hand column below.\"))","v":"If testing is required for this benefit classification: \nPlease ensure each different cost-share combination is entered above in PART 1."},null,null,null,null,null,null,null,null,{"$f":"IF(INDEX(AN$69:AN$72,MATCH(AL89,AL$69:AL$72,0))=\"\",\"If testing is required for this benefit classification: \nPlease ensure each different cost-share combination is entered above in PART 1.\",IF(INDEX(AN$69:AN$72,MATCH(AL89,AL$69:AL$72,0))>=(2/3),\"Applies to substantially all medical/surgical benefits in this classification.\nENTER different \"&LOWER(AL89)&\" amounts from smallest to largest.\",\"Does not apply to substantially all medical/surgical benefits in this classification. \nDELETE any values in the left-hand column below.\"))","v":"If testing is required for this benefit classification: \nPlease ensure each different cost-share combination is entered above in PART 1."},null,null,null,null,null,null,null,null,{"$f":"IF(INDEX(AW$69:AW$72,MATCH(AU89,AU$69:AU$72,0))=\"\",\"If testing is required for this benefit classification: \nPlease ensure each different cost-share combination is entered above in PART 1.\",IF(INDEX(AW$69:AW$72,MATCH(AU89,AU$69:AU$72,0))>=(2/3),\"Applies to substantially all medical/surgical benefits in this classification.\nENTER different \"&LOWER(AU89)&\" amounts from smallest to largest.\",\"Does not apply to substantially all medical/surgical benefits in this classification. \nDELETE any values in the left-hand column below.\"))","v":"If testing is required for this benefit classification: \nPlease ensure each different cost-share combination is entered above in PART 1."},null,null,null,null,null,null,null,null,{"$f":"IF(INDEX(BF$69:BF$72,MATCH(BD89,BD$69:BD$72,0))=\"\",\"If testing is required for this benefit classification: \nPlease ensure each different cost-share combination is entered above in PART 1.\",IF(INDEX(BF$69:BF$72,MATCH(BD89,BD$69:BD$72,0))>=(2/3),\"Applies to substantially all medical/surgical benefits in this classification.\nENTER different \"&LOWER(BD89)&\" amounts from smallest to largest.\",\"Does not apply to substantially all medical/surgical benefits in this classification. \nDELETE any values in the left-hand column below.\"))","v":"If testing is required for this benefit classification: \nPlease ensure each different cost-share combination is entered above in PART 1."},null,null,null,null,null,null,null,null,{"$f":"IF(INDEX(BO$69:BO$72,MATCH(BM89,BM$69:BM$72,0))=\"\",\"If testing is required for this benefit classification: \nPlease ensure each different cost-share combination is entered above in PART 1.\",IF(INDEX(BO$69:BO$72,MATCH(BM89,BM$69:BM$72,0))>=(2/3),\"Applies to substantially all medical/surgical benefits in this classification.\nENTER different \"&LOWER(BM89)&\" amounts from smallest to largest.\",\"Does not apply to substantially all medical/surgical benefits in this classification. \nDELETE any values in the left-hand column below.\"))","v":"If testing is required for this benefit classification: \nPlease ensure each different cost-share combination is entered above in PART 1."},null,null,null,null,null,null,null,null,{"$f":"IF(INDEX(BX$69:BX$72,MATCH(BV89,BV$69:BV$72,0))=\"\",\"If testing is required for this benefit classification: \nPlease ensure each different cost-share combination is entered above in PART 1.\",IF(INDEX(BX$69:BX$72,MATCH(BV89,BV$69:BV$72,0))>=(2/3),\"Applies to substantially all medical/surgical benefits in this classification.\nENTER different \"&LOWER(BV89)&\" amounts from smallest to largest.\",\"Does not apply to substantially all medical/surgical benefits in this classification. \nDELETE any values in the left-hand column below.\"))","v":"If testing is required for this benefit classification: \nPlease ensure each different cost-share combination is entered above in PART 1."},null,null,null,null,null,null,null,null,{"$f":"IF(INDEX(CG$69:CG$72,MATCH(CE89,CE$69:CE$72,0))=\"\",\"If testing is required for this benefit classification: \nPlease ensure each different cost-share combination is entered above in PART 1.\",IF(INDEX(CG$69:CG$72,MATCH(CE89,CE$69:CE$72,0))>=(2/3),\"Applies to substantially all medical/surgical benefits in this classification.\nENTER different \"&LOWER(CE89)&\" amounts from smallest to largest.\",\"Does not apply to substantially all medical/surgical benefits in this classification. \nDELETE any values in the left-hand column below.\"))","v":"If testing is required for this benefit classification: \nPlease ensure each different cost-share combination is entered above in PART 1."},null,null,null,null,null,null,null,null,{"$f":"IF(INDEX(CP$69:CP$72,MATCH(CN89,CN$69:CN$72,0))=\"\",\"If testing is required for this benefit classification: \nPlease ensure each different cost-share combination is entered above in PART 1.\",IF(INDEX(CP$69:CP$72,MATCH(CN89,CN$69:CN$72,0))>=(2/3),\"Applies to substantially all medical/surgical benefits in this classification.\nENTER different \"&LOWER(CN89)&\" amounts from smallest to largest.\",\"Does not apply to substantially all medical/surgical benefits in this classification. \nDELETE any values in the left-hand column below.\"))","v":"If testing is required for this benefit classification: \nPlease ensure each different cost-share combination is entered above in PART 1."}]
[]
[]
[null,null,null,null,null,null,null,null,null,null,"Copayment","Allowed Claims","Portion","Predominant & Smaller","Error Checking",null,null,null,null,"Copayment","Allowed Claims","Portion","Predominant & Smaller","Error Checking",null,null,null,null,"Copayment","Allowed Claims","Portion","Predominant & Smaller","Error Checking",null,null,null,null,"Copayment","Allowed Claims","Portion","Predominant & Smaller","Error Checking",null,null,null,null,"Copayment","Allowed Claims","Portion","Predominant & Smaller","Error Checking",null,null,null,null,"Copayment","Allowed Claims","Portion","Predominant & Smaller","Error Checking",null,null,null,null,"Copayment","Allowed Claims","Portion","Predominant & Smaller","Error Checking",null,null,null,null,"Copayment","Allowed Claims","Portion","Predominant & Smaller","Error Checking",null,null,null,null,"Copayment","Allowed Claims","Portion","Predominant & Smaller","Error Checking",null,null,null,null,"Copayment","Allowed Claims","Portion","Predominant & Smaller","Error Checking"]
[null,null,null,null,null,null,null,null,null,null,null,{"$f":"SUMIF(tbl_IPINN_P1[Copayment],K90,tbl_IPINN_P1[Plan Projected Allowed Amount])","v":0},{"$f":"IF(OR(L90=0,L90=\"\"),\"\",L90/tbl_IPINN_P2Cop[[#Totals],[Allowed Claims]])","v":""},{"$f":"IF(M90=\"\",\"\",IF(SUMIF(tbl_IPINN_P2Cop[Copayment],\">=\"&K90,tbl_IPINN_P2Cop[Portion])>0.5,K90,\"\"))","v":""},{"$f":"IF(COUNTIF(tbl_IPINN_P2Cop[Copayment],tbl_IPINN_P2Cop[[#This Row],[Copayment]])>1,\"Remove Duplicate Entry.\",IF(AND(tbl_IPINN_P2Cop[[#This Row],[Copayment]]<>\"\",tbl_IPINN_P2Cop[[#This Row],[Allowed Claims]]=0),\"Entry not found in Part 1 Table\",IF(AND(OFFSET(tbl_IPINN_P2Cop[[#This Row],[Copayment]],1,0)<>\"Total\",OFFSET(tbl_IPINN_P2Cop[[#This Row],[Copayment]],1,0)<>\"\",OFFSET(tbl_IPINN_P2Cop[[#This Row],[Copayment]],1,0)<tbl_IPINN_P2Cop[[#This Row],[Copayment]]),\"Sort Entries from lowest to highest\",\"\")))","v":""},null,null,null,null,null,{"$f":"SUMIF(tbl_IPOON_P1[Copayment],T90,tbl_IPOON_P1[Plan Projected Allowed Amount])","v":0},{"$f":"IF(OR(U90=0,U90=\"\"),\"\",U90/tbl_IPOON_P2Cop[[#Totals],[Allowed Claims]])","v":""},{"$f":"IF(V90=\"\",\"\",IF(SUMIF(tbl_IPOON_P2Cop[Copayment],\">=\"&T90,tbl_IPOON_P2Cop[Portion])>0.5,T90,\"\"))","v":""},{"$f":"IF(COUNTIF(tbl_IPOON_P2Cop[Copayment],tbl_IPOON_P2Cop[[#This Row],[Copayment]])>1,\"Remove Duplicate Entry.\",IF(AND(tbl_IPOON_P2Cop[[#This Row],[Copayment]]<>\"\",tbl_IPOON_P2Cop[[#This Row],[Allowed Claims]]=0),\"Entry not found in Part 1 Table\",IF(AND(OFFSET(tbl_IPOON_P2Cop[[#This Row],[Copayment]],1,0)<>\"Total\",OFFSET(tbl_IPOON_P2Cop[[#This Row],[Copayment]],1,0)<>\"\",OFFSET(tbl_IPOON_P2Cop[[#This Row],[Copayment]],1,0)<tbl_IPOON_P2Cop[[#This Row],[Copayment]]),\"Sort Entries from lowest to highest\",\"\")))","v":""},null,null,null,null,null,{"$f":"SUMIF(tbl_OPINN_P1[Copayment],AC90,tbl_OPINN_P1[Plan Projected Allowed Amount])","v":0},{"$f":"IF(OR(AD90=0,AD90=\"\"),\"\",AD90/tbl_OPINN_P2Cop[[#Totals],[Allowed Claims]])","v":""},{"$f":"IF(AE90=\"\",\"\",IF(SUMIF(tbl_OPINN_P2Cop[Copayment],\">=\"&AC90,tbl_OPINN_P2Cop[Portion])>0.5,AC90,\"\"))","v":""},{"$f":"IF(COUNTIF(tbl_OPINN_P2Cop[Copayment],tbl_OPINN_P2Cop[[#This Row],[Copayment]])>1,\"Remove Duplicate Entry.\",IF(AND(tbl_OPINN_P2Cop[[#This Row],[Copayment]]<>\"\",tbl_OPINN_P2Cop[[#This Row],[Allowed Claims]]=0),\"Entry not found in Part 1 Table\",IF(AND(OFFSET(tbl_OPINN_P2Cop[[#This Row],[Copayment]],1,0)<>\"Total\",OFFSET(tbl_OPINN_P2Cop[[#This Row],[Copayment]],1,0)<>\"\",OFFSET(tbl_OPINN_P2Cop[[#This Row],[Copayment]],1,0)<tbl_OPINN_P2Cop[[#This Row],[Copayment]]),\"Sort Entries from lowest to highest\",\"\")))","v":""},null,null,null,null,null,{"$f":"SUMIF(tbl_OPOVINN_P1[Copayment],AL90,tbl_OPOVINN_P1[Plan Projected Allowed Amount])","v":0},{"$f":"IF(OR(AM90=0,AM90=\"\"),\"\",AM90/tbl_OPOVINN_P2Cop[[#Totals],[Allowed Claims]])","v":""},{"$f":"IF(AN90=\"\",\"\",IF(SUMIF(tbl_OPOVINN_P2Cop[Copayment],\">=\"&AL90,tbl_OPOVINN_P2Cop[Portion])>0.5,AL90,\"\"))","v":""},{"$f":"IF(COUNTIF(tbl_OPOVINN_P2Cop[Copayment],tbl_OPOVINN_P2Cop[[#This Row],[Copayment]])>1,\"Remove Duplicate Entry.\",IF(AND(tbl_OPOVINN_P2Cop[[#This Row],[Copayment]]<>\"\",tbl_OPOVINN_P2Cop[[#This Row],[Allowed Claims]]=0),\"Entry not found in Part 1 Table\",IF(AND(OFFSET(tbl_OPOVINN_P2Cop[[#This Row],[Copayment]],1,0)<>\"Total\",OFFSET(tbl_OPOVINN_P2Cop[[#This Row],[Copayment]],1,0)<>\"\",OFFSET(tbl_OPOVINN_P2Cop[[#This Row],[Copayment]],1,0)<tbl_OPOVINN_P2Cop[[#This Row],[Copayment]]),\"Sort Entries from lowest to highest\",\"\")))","v":""},null,null,null,null,null,{"$f":"SUMIF(tbl_OPAOINN_P1[Copayment],AU90,tbl_OPAOINN_P1[Plan Projected Allowed Amount])","v":0},{"$f":"IF(OR(AV90=0,AV90=\"\"),\"\",AV90/tbl_OPAOINN_P2Cop[[#Totals],[Allowed Claims]])","v":""},{"$f":"IF(AW90=\"\",\"\",IF(SUMIF(tbl_OPAOINN_P2Cop[Copayment],\">=\"&AU90,tbl_OPAOINN_P2Cop[Portion])>0.5,AU90,\"\"))","v":""},{"$f":"IF(COUNTIF(tbl_OPAOINN_P2Cop[Copayment],tbl_OPAOINN_P2Cop[[#This Row],[Copayment]])>1,\"Remove Duplicate Entry.\",IF(AND(tbl_OPAOINN_P2Cop[[#This Row],[Copayment]]<>\"\",tbl_OPAOINN_P2Cop[[#This Row],[Allowed Claims]]=0),\"Entry not found in Part 1 Table\",IF(AND(OFFSET(tbl_OPAOINN_P2Cop[[#This Row],[Copayment]],1,0)<>\"Total\",OFFSET(tbl_OPAOINN_P2Cop[[#This Row],[Copayment]],1,0)<>\"\",OFFSET(tbl_OPAOINN_P2Cop[[#This Row],[Copayment]],1,0)<tbl_OPAOINN_P2Cop[[#This Row],[Copayment]]),\"Sort Entries from lowest to highest\",\"\")))","v":""},null,null,null,null,null,{"$f":"SUMIF(tbl_OPOON_P1[Copayment],BD90,tbl_OPOON_P1[Plan Projected Allowed Amount])","v":0},{"$f":"IF(OR(BE90=0,BE90=\"\"),\"\",BE90/tbl_OPOON_P2Cop[[#Totals],[Allowed Claims]])","v":""},{"$f":"IF(BF90=\"\",\"\",IF(SUMIF(tbl_OPOON_P2Cop[Copayment],\">=\"&BD90,tbl_OPOON_P2Cop[Portion])>0.5,BD90,\"\"))","v":""},{"$f":"IF(COUNTIF(tbl_OPOON_P2Cop[Copayment],tbl_OPOON_P2Cop[[#This Row],[Copayment]])>1,\"Remove Duplicate Entry.\",IF(AND(tbl_OPOON_P2Cop[[#This Row],[Copayment]]<>\"\",tbl_OPOON_P2Cop[[#This Row],[Allowed Claims]]=0),\"Entry not found in Part 1 Table\",IF(AND(OFFSET(tbl_OPOON_P2Cop[[#This Row],[Copayment]],1,0)<>\"Total\",OFFSET(tbl_OPOON_P2Cop[[#This Row],[Copayment]],1,0)<>\"\",OFFSET(tbl_OPOON_P2Cop[[#This Row],[Copayment]],1,0)<tbl_OPOON_P2Cop[[#This Row],[Copayment]]),\"Sort Entries from lowest to highest\",\"\")))","v":""},null,null,null,null,null,{"$f":"SUMIF(tbl_OPOVOON_P1[Copayment],BM90,tbl_OPOVOON_P1[Plan Projected Allowed Amount])","v":0},{"$f":"IF(OR(BN90=0,BN90=\"\"),\"\",BN90/tbl_OPOVOON_P2Cop[[#Totals],[Allowed Claims]])","v":""},{"$f":"IF(BO90=\"\",\"\",IF(SUMIF(tbl_OPOVOON_P2Cop[Copayment],\">=\"&BM90,tbl_OPOVOON_P2Cop[Portion])>0.5,BM90,\"\"))","v":""},{"$f":"IF(COUNTIF(tbl_OPOVOON_P2Cop[Copayment],tbl_OPOVOON_P2Cop[[#This Row],[Copayment]])>1,\"Remove Duplicate Entry.\",IF(AND(tbl_OPOVOON_P2Cop[[#This Row],[Copayment]]<>\"\",tbl_OPOVOON_P2Cop[[#This Row],[Allowed Claims]]=0),\"Entry not found in Part 1 Table\",IF(AND(OFFSET(tbl_OPOVOON_P2Cop[[#This Row],[Copayment]],1,0)<>\"Total\",OFFSET(tbl_OPOVOON_P2Cop[[#This Row],[Copayment]],1,0)<>\"\",OFFSET(tbl_OPOVOON_P2Cop[[#This Row],[Copayment]],1,0)<tbl_OPOVOON_P2Cop[[#This Row],[Copayment]]),\"Sort Entries from lowest to highest\",\"\")))","v":""},null,null,null,null,null,{"$f":"SUMIF(tbl_OPAOOON_P1[Copayment],BV90,tbl_OPAOOON_P1[Plan Projected Allowed Amount])","v":0},{"$f":"IF(OR(BW90=0,BW90=\"\"),\"\",BW90/tbl_OPAOOON_P2Cop[[#Totals],[Allowed Claims]])","v":""},{"$f":"IF(BX90=\"\",\"\",IF(SUMIF(tbl_OPAOOON_P2Cop[Copayment],\">=\"&BV90,tbl_OPAOOON_P2Cop[Portion])>0.5,BV90,\"\"))","v":""},{"$f":"IF(COUNTIF(tbl_OPAOOON_P2Cop[Copayment],tbl_OPAOOON_P2Cop[[#This Row],[Copayment]])>1,\"Remove Duplicate Entry.\",IF(AND(tbl_OPAOOON_P2Cop[[#This Row],[Copayment]]<>\"\",tbl_OPAOOON_P2Cop[[#This Row],[Allowed Claims]]=0),\"Entry not found in Part 1 Table\",IF(AND(OFFSET(tbl_OPAOOON_P2Cop[[#This Row],[Copayment]],1,0)<>\"Total\",OFFSET(tbl_OPAOOON_P2Cop[[#This Row],[Copayment]],1,0)<>\"\",OFFSET(tbl_OPAOOON_P2Cop[[#This Row],[Copayment]],1,0)<tbl_OPAOOON_P2Cop[[#This Row],[Copayment]]),\"Sort Entries from lowest to highest\",\"\")))","v":""},null,null,null,null,null,{"$f":"SUMIF(tbl_ER_P1[Copayment],CE90,tbl_ER_P1[Plan Projected Allowed Amount])","v":0},{"$f":"IF(OR(CF90=0,CF90=\"\"),\"\",CF90/tbl_ER_P2Cop[[#Totals],[Allowed Claims]])","v":""},{"$f":"IF(CG90=\"\",\"\",IF(SUMIF(tbl_ER_P2Cop[Copayment],\">=\"&CE90,tbl_ER_P2Cop[Portion])>0.5,CE90,\"\"))","v":""},{"$f":"IF(COUNTIF(tbl_ER_P2Cop[Copayment],tbl_ER_P2Cop[[#This Row],[Copayment]])>1,\"Remove Duplicate Entry.\",IF(AND(tbl_ER_P2Cop[[#This Row],[Copayment]]<>\"\",tbl_ER_P2Cop[[#This Row],[Allowed Claims]]=0),\"Entry not found in Part 1 Table\",IF(AND(OFFSET(tbl_ER_P2Cop[[#This Row],[Copayment]],1,0)<>\"Total\",OFFSET(tbl_ER_P2Cop[[#This Row],[Copayment]],1,0)<>\"\",OFFSET(tbl_ER_P2Cop[[#This Row],[Copayment]],1,0)<tbl_ER_P2Cop[[#This Row],[Copayment]]),\"Sort Entries from lowest to highest\",\"\")))","v":""},null,null,null,null,null,{"$f":"SUMIF(tbl_RX_P1[Copayment],CN90,tbl_RX_P1[Plan Projected Allowed Amount])","v":0},{"$f":"IF(OR(CO90=0,CO90=\"\"),\"\",CO90/tbl_RX_P2Cop[[#Totals],[Allowed Claims]])","v":""},{"$f":"IF(CP90=\"\",\"\",IF(SUMIF(tbl_RX_P2Cop[Copayment],\">=\"&CN90,tbl_RX_P2Cop[Portion])>0.5,CN90,\"\"))","v":""},{"$f":"IF(COUNTIF(tbl_RX_P2Cop[Copayment],tbl_RX_P2Cop[[#This Row],[Copayment]])>1,\"Remove Duplicate Entry.\",IF(AND(tbl_RX_P2Cop[[#This Row],[Copayment]]<>\"\",tbl_RX_P2Cop[[#This Row],[Allowed Claims]]=0),\"Entry not found in Part 1 Table\",IF(AND(OFFSET(tbl_RX_P2Cop[[#This Row],[Copayment]],1,0)<>\"Total\",OFFSET(tbl_RX_P2Cop[[#This Row],[Copayment]],1,0)<>\"\",OFFSET(tbl_RX_P2Cop[[#This Row],[Copayment]],1,0)<tbl_RX_P2Cop[[#This Row],[Copayment]]),\"Sort Entries from lowest to highest\",\"\")))","v":""}]
[null,null,null,null,null,null,null,null,null,null,null,{"$f":"SUMIF(tbl_IPINN_P1[Copayment],K91,tbl_IPINN_P1[Plan Projected Allowed Amount])","v":0},{"$f":"IF(OR(L91=0,L91=\"\"),\"\",L91/tbl_IPINN_P2Cop[[#Totals],[Allowed Claims]])","v":""},{"$f":"IF(M91=\"\",\"\",IF(SUMIF(tbl_IPINN_P2Cop[Copayment],\">=\"&K91,tbl_IPINN_P2Cop[Portion])>0.5,K91,\"\"))","v":""},{"$f":"IF(COUNTIF(tbl_IPINN_P2Cop[Copayment],tbl_IPINN_P2Cop[[#This Row],[Copayment]])>1,\"Remove Duplicate Entry.\",IF(AND(tbl_IPINN_P2Cop[[#This Row],[Copayment]]<>\"\",tbl_IPINN_P2Cop[[#This Row],[Allowed Claims]]=0),\"Entry not found in Part 1 Table\",IF(AND(OFFSET(tbl_IPINN_P2Cop[[#This Row],[Copayment]],1,0)<>\"Total\",OFFSET(tbl_IPINN_P2Cop[[#This Row],[Copayment]],1,0)<>\"\",OFFSET(tbl_IPINN_P2Cop[[#This Row],[Copayment]],1,0)<tbl_IPINN_P2Cop[[#This Row],[Copayment]]),\"Sort Entries from lowest to highest\",\"\")))","v":""},null,null,null,null,null,{"$f":"SUMIF(tbl_IPOON_P1[Copayment],T91,tbl_IPOON_P1[Plan Projected Allowed Amount])","v":0},{"$f":"IF(OR(U91=0,U91=\"\"),\"\",U91/tbl_IPOON_P2Cop[[#Totals],[Allowed Claims]])","v":""},{"$f":"IF(V91=\"\",\"\",IF(SUMIF(tbl_IPOON_P2Cop[Copayment],\">=\"&T91,tbl_IPOON_P2Cop[Portion])>0.5,T91,\"\"))","v":""},{"$f":"IF(COUNTIF(tbl_IPOON_P2Cop[Copayment],tbl_IPOON_P2Cop[[#This Row],[Copayment]])>1,\"Remove Duplicate Entry.\",IF(AND(tbl_IPOON_P2Cop[[#This Row],[Copayment]]<>\"\",tbl_IPOON_P2Cop[[#This Row],[Allowed Claims]]=0),\"Entry not found in Part 1 Table\",IF(AND(OFFSET(tbl_IPOON_P2Cop[[#This Row],[Copayment]],1,0)<>\"Total\",OFFSET(tbl_IPOON_P2Cop[[#This Row],[Copayment]],1,0)<>\"\",OFFSET(tbl_IPOON_P2Cop[[#This Row],[Copayment]],1,0)<tbl_IPOON_P2Cop[[#This Row],[Copayment]]),\"Sort Entries from lowest to highest\",\"\")))","v":""},null,null,null,null,null,{"$f":"SUMIF(tbl_OPINN_P1[Copayment],AC91,tbl_OPINN_P1[Plan Projected Allowed Amount])","v":0},{"$f":"IF(OR(AD91=0,AD91=\"\"),\"\",AD91/tbl_OPINN_P2Cop[[#Totals],[Allowed Claims]])","v":""},{"$f":"IF(AE91=\"\",\"\",IF(SUMIF(tbl_OPINN_P2Cop[Copayment],\">=\"&AC91,tbl_OPINN_P2Cop[Portion])>0.5,AC91,\"\"))","v":""},{"$f":"IF(COUNTIF(tbl_OPINN_P2Cop[Copayment],tbl_OPINN_P2Cop[[#This Row],[Copayment]])>1,\"Remove Duplicate Entry.\",IF(AND(tbl_OPINN_P2Cop[[#This Row],[Copayment]]<>\"\",tbl_OPINN_P2Cop[[#This Row],[Allowed Claims]]=0),\"Entry not found in Part 1 Table\",IF(AND(OFFSET(tbl_OPINN_P2Cop[[#This Row],[Copayment]],1,0)<>\"Total\",OFFSET(tbl_OPINN_P2Cop[[#This Row],[Copayment]],1,0)<>\"\",OFFSET(tbl_OPINN_P2Cop[[#This Row],[Copayment]],1,0)<tbl_OPINN_P2Cop[[#This Row],[Copayment]]),\"Sort Entries from lowest to highest\",\"\")))","v":""},null,null,null,null,null,{"$f":"SUMIF(tbl_OPOVINN_P1[Copayment],AL91,tbl_OPOVINN_P1[Plan Projected Allowed Amount])","v":0},{"$f":"IF(OR(AM91=0,AM91=\"\"),\"\",AM91/tbl_OPOVINN_P2Cop[[#Totals],[Allowed Claims]])","v":""},{"$f":"IF(AN91=\"\",\"\",IF(SUMIF(tbl_OPOVINN_P2Cop[Copayment],\">=\"&AL91,tbl_OPOVINN_P2Cop[Portion])>0.5,AL91,\"\"))","v":""},{"$f":"IF(COUNTIF(tbl_OPOVINN_P2Cop[Copayment],tbl_OPOVINN_P2Cop[[#This Row],[Copayment]])>1,\"Remove Duplicate Entry.\",IF(AND(tbl_OPOVINN_P2Cop[[#This Row],[Copayment]]<>\"\",tbl_OPOVINN_P2Cop[[#This Row],[Allowed Claims]]=0),\"Entry not found in Part 1 Table\",IF(AND(OFFSET(tbl_OPOVINN_P2Cop[[#This Row],[Copayment]],1,0)<>\"Total\",OFFSET(tbl_OPOVINN_P2Cop[[#This Row],[Copayment]],1,0)<>\"\",OFFSET(tbl_OPOVINN_P2Cop[[#This Row],[Copayment]],1,0)<tbl_OPOVINN_P2Cop[[#This Row],[Copayment]]),\"Sort Entries from lowest to highest\",\"\")))","v":""},null,null,null,null,null,{"$f":"SUMIF(tbl_OPAOINN_P1[Copayment],AU91,tbl_OPAOINN_P1[Plan Projected Allowed Amount])","v":0},{"$f":"IF(OR(AV91=0,AV91=\"\"),\"\",AV91/tbl_OPAOINN_P2Cop[[#Totals],[Allowed Claims]])","v":""},{"$f":"IF(AW91=\"\",\"\",IF(SUMIF(tbl_OPAOINN_P2Cop[Copayment],\">=\"&AU91,tbl_OPAOINN_P2Cop[Portion])>0.5,AU91,\"\"))","v":""},{"$f":"IF(COUNTIF(tbl_OPAOINN_P2Cop[Copayment],tbl_OPAOINN_P2Cop[[#This Row],[Copayment]])>1,\"Remove Duplicate Entry.\",IF(AND(tbl_OPAOINN_P2Cop[[#This Row],[Copayment]]<>\"\",tbl_OPAOINN_P2Cop[[#This Row],[Allowed Claims]]=0),\"Entry not found in Part 1 Table\",IF(AND(OFFSET(tbl_OPAOINN_P2Cop[[#This Row],[Copayment]],1,0)<>\"Total\",OFFSET(tbl_OPAOINN_P2Cop[[#This Row],[Copayment]],1,0)<>\"\",OFFSET(tbl_OPAOINN_P2Cop[[#This Row],[Copayment]],1,0)<tbl_OPAOINN_P2Cop[[#This Row],[Copayment]]),\"Sort Entries from lowest to highest\",\"\")))","v":""},null,null,null,null,null,{"$f":"SUMIF(tbl_OPOON_P1[Copayment],BD91,tbl_OPOON_P1[Plan Projected Allowed Amount])","v":0},{"$f":"IF(OR(BE91=0,BE91=\"\"),\"\",BE91/tbl_OPOON_P2Cop[[#Totals],[Allowed Claims]])","v":""},{"$f":"IF(BF91=\"\",\"\",IF(SUMIF(tbl_OPOON_P2Cop[Copayment],\">=\"&BD91,tbl_OPOON_P2Cop[Portion])>0.5,BD91,\"\"))","v":""},{"$f":"IF(COUNTIF(tbl_OPOON_P2Cop[Copayment],tbl_OPOON_P2Cop[[#This Row],[Copayment]])>1,\"Remove Duplicate Entry.\",IF(AND(tbl_OPOON_P2Cop[[#This Row],[Copayment]]<>\"\",tbl_OPOON_P2Cop[[#This Row],[Allowed Claims]]=0),\"Entry not found in Part 1 Table\",IF(AND(OFFSET(tbl_OPOON_P2Cop[[#This Row],[Copayment]],1,0)<>\"Total\",OFFSET(tbl_OPOON_P2Cop[[#This Row],[Copayment]],1,0)<>\"\",OFFSET(tbl_OPOON_P2Cop[[#This Row],[Copayment]],1,0)<tbl_OPOON_P2Cop[[#This Row],[Copayment]]),\"Sort Entries from lowest to highest\",\"\")))","v":""},null,null,null,null,null,{"$f":"SUMIF(tbl_OPOVOON_P1[Copayment],BM91,tbl_OPOVOON_P1[Plan Projected Allowed Amount])","v":0},{"$f":"IF(OR(BN91=0,BN91=\"\"),\"\",BN91/tbl_OPOVOON_P2Cop[[#Totals],[Allowed Claims]])","v":""},{"$f":"IF(BO91=\"\",\"\",IF(SUMIF(tbl_OPOVOON_P2Cop[Copayment],\">=\"&BM91,tbl_OPOVOON_P2Cop[Portion])>0.5,BM91,\"\"))","v":""},{"$f":"IF(COUNTIF(tbl_OPOVOON_P2Cop[Copayment],tbl_OPOVOON_P2Cop[[#This Row],[Copayment]])>1,\"Remove Duplicate Entry.\",IF(AND(tbl_OPOVOON_P2Cop[[#This Row],[Copayment]]<>\"\",tbl_OPOVOON_P2Cop[[#This Row],[Allowed Claims]]=0),\"Entry not found in Part 1 Table\",IF(AND(OFFSET(tbl_OPOVOON_P2Cop[[#This Row],[Copayment]],1,0)<>\"Total\",OFFSET(tbl_OPOVOON_P2Cop[[#This Row],[Copayment]],1,0)<>\"\",OFFSET(tbl_OPOVOON_P2Cop[[#This Row],[Copayment]],1,0)<tbl_OPOVOON_P2Cop[[#This Row],[Copayment]]),\"Sort Entries from lowest to highest\",\"\")))","v":""},null,null,null,null,null,{"$f":"SUMIF(tbl_OPAOOON_P1[Copayment],BV91,tbl_OPAOOON_P1[Plan Projected Allowed Amount])","v":0},{"$f":"IF(OR(BW91=0,BW91=\"\"),\"\",BW91/tbl_OPAOOON_P2Cop[[#Totals],[Allowed Claims]])","v":""},{"$f":"IF(BX91=\"\",\"\",IF(SUMIF(tbl_OPAOOON_P2Cop[Copayment],\">=\"&BV91,tbl_OPAOOON_P2Cop[Portion])>0.5,BV91,\"\"))","v":""},{"$f":"IF(COUNTIF(tbl_OPAOOON_P2Cop[Copayment],tbl_OPAOOON_P2Cop[[#This Row],[Copayment]])>1,\"Remove Duplicate Entry.\",IF(AND(tbl_OPAOOON_P2Cop[[#This Row],[Copayment]]<>\"\",tbl_OPAOOON_P2Cop[[#This Row],[Allowed Claims]]=0),\"Entry not found in Part 1 Table\",IF(AND(OFFSET(tbl_OPAOOON_P2Cop[[#This Row],[Copayment]],1,0)<>\"Total\",OFFSET(tbl_OPAOOON_P2Cop[[#This Row],[Copayment]],1,0)<>\"\",OFFSET(tbl_OPAOOON_P2Cop[[#This Row],[Copayment]],1,0)<tbl_OPAOOON_P2Cop[[#This Row],[Copayment]]),\"Sort Entries from lowest to highest\",\"\")))","v":""},null,null,null,null,null,{"$f":"SUMIF(tbl_ER_P1[Copayment],CE91,tbl_ER_P1[Plan Projected Allowed Amount])","v":0},{"$f":"IF(OR(CF91=0,CF91=\"\"),\"\",CF91/tbl_ER_P2Cop[[#Totals],[Allowed Claims]])","v":""},{"$f":"IF(CG91=\"\",\"\",IF(SUMIF(tbl_ER_P2Cop[Copayment],\">=\"&CE91,tbl_ER_P2Cop[Portion])>0.5,CE91,\"\"))","v":""},{"$f":"IF(COUNTIF(tbl_ER_P2Cop[Copayment],tbl_ER_P2Cop[[#This Row],[Copayment]])>1,\"Remove Duplicate Entry.\",IF(AND(tbl_ER_P2Cop[[#This Row],[Copayment]]<>\"\",tbl_ER_P2Cop[[#This Row],[Allowed Claims]]=0),\"Entry not found in Part 1 Table\",IF(AND(OFFSET(tbl_ER_P2Cop[[#This Row],[Copayment]],1,0)<>\"Total\",OFFSET(tbl_ER_P2Cop[[#This Row],[Copayment]],1,0)<>\"\",OFFSET(tbl_ER_P2Cop[[#This Row],[Copayment]],1,0)<tbl_ER_P2Cop[[#This Row],[Copayment]]),\"Sort Entries from lowest to highest\",\"\")))","v":""},null,null,null,null,null,{"$f":"SUMIF(tbl_RX_P1[Copayment],CN91,tbl_RX_P1[Plan Projected Allowed Amount])","v":0},{"$f":"IF(OR(CO91=0,CO91=\"\"),\"\",CO91/tbl_RX_P2Cop[[#Totals],[Allowed Claims]])","v":""},{"$f":"IF(CP91=\"\",\"\",IF(SUMIF(tbl_RX_P2Cop[Copayment],\">=\"&CN91,tbl_RX_P2Cop[Portion])>0.5,CN91,\"\"))","v":""},{"$f":"IF(COUNTIF(tbl_RX_P2Cop[Copayment],tbl_RX_P2Cop[[#This Row],[Copayment]])>1,\"Remove Duplicate Entry.\",IF(AND(tbl_RX_P2Cop[[#This Row],[Copayment]]<>\"\",tbl_RX_P2Cop[[#This Row],[Allowed Claims]]=0),\"Entry not found in Part 1 Table\",IF(AND(OFFSET(tbl_RX_P2Cop[[#This Row],[Copayment]],1,0)<>\"Total\",OFFSET(tbl_RX_P2Cop[[#This Row],[Copayment]],1,0)<>\"\",OFFSET(tbl_RX_P2Cop[[#This Row],[Copayment]],1,0)<tbl_RX_P2Cop[[#This Row],[Copayment]]),\"Sort Entries from lowest to highest\",\"\")))","v":""}]
[null,null,null,null,null,null,null,null,null,null,null,{"$f":"SUMIF(tbl_IPINN_P1[Copayment],K92,tbl_IPINN_P1[Plan Projected Allowed Amount])","v":0},{"$f":"IF(OR(L92=0,L92=\"\"),\"\",L92/tbl_IPINN_P2Cop[[#Totals],[Allowed Claims]])","v":""},{"$f":"IF(M92=\"\",\"\",IF(SUMIF(tbl_IPINN_P2Cop[Copayment],\">=\"&K92,tbl_IPINN_P2Cop[Portion])>0.5,K92,\"\"))","v":""},{"$f":"IF(COUNTIF(tbl_IPINN_P2Cop[Copayment],tbl_IPINN_P2Cop[[#This Row],[Copayment]])>1,\"Remove Duplicate Entry.\",IF(AND(tbl_IPINN_P2Cop[[#This Row],[Copayment]]<>\"\",tbl_IPINN_P2Cop[[#This Row],[Allowed Claims]]=0),\"Entry not found in Part 1 Table\",IF(AND(OFFSET(tbl_IPINN_P2Cop[[#This Row],[Copayment]],1,0)<>\"Total\",OFFSET(tbl_IPINN_P2Cop[[#This Row],[Copayment]],1,0)<>\"\",OFFSET(tbl_IPINN_P2Cop[[#This Row],[Copayment]],1,0)<tbl_IPINN_P2Cop[[#This Row],[Copayment]]),\"Sort Entries from lowest to highest\",\"\")))","v":""},null,null,null,null,null,{"$f":"SUMIF(tbl_IPOON_P1[Copayment],T92,tbl_IPOON_P1[Plan Projected Allowed Amount])","v":0},{"$f":"IF(OR(U92=0,U92=\"\"),\"\",U92/tbl_IPOON_P2Cop[[#Totals],[Allowed Claims]])","v":""},{"$f":"IF(V92=\"\",\"\",IF(SUMIF(tbl_IPOON_P2Cop[Copayment],\">=\"&T92,tbl_IPOON_P2Cop[Portion])>0.5,T92,\"\"))","v":""},{"$f":"IF(COUNTIF(tbl_IPOON_P2Cop[Copayment],tbl_IPOON_P2Cop[[#This Row],[Copayment]])>1,\"Remove Duplicate Entry.\",IF(AND(tbl_IPOON_P2Cop[[#This Row],[Copayment]]<>\"\",tbl_IPOON_P2Cop[[#This Row],[Allowed Claims]]=0),\"Entry not found in Part 1 Table\",IF(AND(OFFSET(tbl_IPOON_P2Cop[[#This Row],[Copayment]],1,0)<>\"Total\",OFFSET(tbl_IPOON_P2Cop[[#This Row],[Copayment]],1,0)<>\"\",OFFSET(tbl_IPOON_P2Cop[[#This Row],[Copayment]],1,0)<tbl_IPOON_P2Cop[[#This Row],[Copayment]]),\"Sort Entries from lowest to highest\",\"\")))","v":""},null,null,null,null,null,{"$f":"SUMIF(tbl_OPINN_P1[Copayment],AC92,tbl_OPINN_P1[Plan Projected Allowed Amount])","v":0},{"$f":"IF(OR(AD92=0,AD92=\"\"),\"\",AD92/tbl_OPINN_P2Cop[[#Totals],[Allowed Claims]])","v":""},{"$f":"IF(AE92=\"\",\"\",IF(SUMIF(tbl_OPINN_P2Cop[Copayment],\">=\"&AC92,tbl_OPINN_P2Cop[Portion])>0.5,AC92,\"\"))","v":""},{"$f":"IF(COUNTIF(tbl_OPINN_P2Cop[Copayment],tbl_OPINN_P2Cop[[#This Row],[Copayment]])>1,\"Remove Duplicate Entry.\",IF(AND(tbl_OPINN_P2Cop[[#This Row],[Copayment]]<>\"\",tbl_OPINN_P2Cop[[#This Row],[Allowed Claims]]=0),\"Entry not found in Part 1 Table\",IF(AND(OFFSET(tbl_OPINN_P2Cop[[#This Row],[Copayment]],1,0)<>\"Total\",OFFSET(tbl_OPINN_P2Cop[[#This Row],[Copayment]],1,0)<>\"\",OFFSET(tbl_OPINN_P2Cop[[#This Row],[Copayment]],1,0)<tbl_OPINN_P2Cop[[#This Row],[Copayment]]),\"Sort Entries from lowest to highest\",\"\")))","v":""},null,null,null,null,null,{"$f":"SUMIF(tbl_OPOVINN_P1[Copayment],AL92,tbl_OPOVINN_P1[Plan Projected Allowed Amount])","v":0},{"$f":"IF(OR(AM92=0,AM92=\"\"),\"\",AM92/tbl_OPOVINN_P2Cop[[#Totals],[Allowed Claims]])","v":""},{"$f":"IF(AN92=\"\",\"\",IF(SUMIF(tbl_OPOVINN_P2Cop[Copayment],\">=\"&AL92,tbl_OPOVINN_P2Cop[Portion])>0.5,AL92,\"\"))","v":""},{"$f":"IF(COUNTIF(tbl_OPOVINN_P2Cop[Copayment],tbl_OPOVINN_P2Cop[[#This Row],[Copayment]])>1,\"Remove Duplicate Entry.\",IF(AND(tbl_OPOVINN_P2Cop[[#This Row],[Copayment]]<>\"\",tbl_OPOVINN_P2Cop[[#This Row],[Allowed Claims]]=0),\"Entry not found in Part 1 Table\",IF(AND(OFFSET(tbl_OPOVINN_P2Cop[[#This Row],[Copayment]],1,0)<>\"Total\",OFFSET(tbl_OPOVINN_P2Cop[[#This Row],[Copayment]],1,0)<>\"\",OFFSET(tbl_OPOVINN_P2Cop[[#This Row],[Copayment]],1,0)<tbl_OPOVINN_P2Cop[[#This Row],[Copayment]]),\"Sort Entries from lowest to highest\",\"\")))","v":""},null,null,null,null,null,{"$f":"SUMIF(tbl_OPAOINN_P1[Copayment],AU92,tbl_OPAOINN_P1[Plan Projected Allowed Amount])","v":0},{"$f":"IF(OR(AV92=0,AV92=\"\"),\"\",AV92/tbl_OPAOINN_P2Cop[[#Totals],[Allowed Claims]])","v":""},{"$f":"IF(AW92=\"\",\"\",IF(SUMIF(tbl_OPAOINN_P2Cop[Copayment],\">=\"&AU92,tbl_OPAOINN_P2Cop[Portion])>0.5,AU92,\"\"))","v":""},{"$f":"IF(COUNTIF(tbl_OPAOINN_P2Cop[Copayment],tbl_OPAOINN_P2Cop[[#This Row],[Copayment]])>1,\"Remove Duplicate Entry.\",IF(AND(tbl_OPAOINN_P2Cop[[#This Row],[Copayment]]<>\"\",tbl_OPAOINN_P2Cop[[#This Row],[Allowed Claims]]=0),\"Entry not found in Part 1 Table\",IF(AND(OFFSET(tbl_OPAOINN_P2Cop[[#This Row],[Copayment]],1,0)<>\"Total\",OFFSET(tbl_OPAOINN_P2Cop[[#This Row],[Copayment]],1,0)<>\"\",OFFSET(tbl_OPAOINN_P2Cop[[#This Row],[Copayment]],1,0)<tbl_OPAOINN_P2Cop[[#This Row],[Copayment]]),\"Sort Entries from lowest to highest\",\"\")))","v":""},null,null,null,null,null,{"$f":"SUMIF(tbl_OPOON_P1[Copayment],BD92,tbl_OPOON_P1[Plan Projected Allowed Amount])","v":0},{"$f":"IF(OR(BE92=0,BE92=\"\"),\"\",BE92/tbl_OPOON_P2Cop[[#Totals],[Allowed Claims]])","v":""},{"$f":"IF(BF92=\"\",\"\",IF(SUMIF(tbl_OPOON_P2Cop[Copayment],\">=\"&BD92,tbl_OPOON_P2Cop[Portion])>0.5,BD92,\"\"))","v":""},{"$f":"IF(COUNTIF(tbl_OPOON_P2Cop[Copayment],tbl_OPOON_P2Cop[[#This Row],[Copayment]])>1,\"Remove Duplicate Entry.\",IF(AND(tbl_OPOON_P2Cop[[#This Row],[Copayment]]<>\"\",tbl_OPOON_P2Cop[[#This Row],[Allowed Claims]]=0),\"Entry not found in Part 1 Table\",IF(AND(OFFSET(tbl_OPOON_P2Cop[[#This Row],[Copayment]],1,0)<>\"Total\",OFFSET(tbl_OPOON_P2Cop[[#This Row],[Copayment]],1,0)<>\"\",OFFSET(tbl_OPOON_P2Cop[[#This Row],[Copayment]],1,0)<tbl_OPOON_P2Cop[[#This Row],[Copayment]]),\"Sort Entries from lowest to highest\",\"\")))","v":""},null,null,null,null,null,{"$f":"SUMIF(tbl_OPOVOON_P1[Copayment],BM92,tbl_OPOVOON_P1[Plan Projected Allowed Amount])","v":0},{"$f":"IF(OR(BN92=0,BN92=\"\"),\"\",BN92/tbl_OPOVOON_P2Cop[[#Totals],[Allowed Claims]])","v":""},{"$f":"IF(BO92=\"\",\"\",IF(SUMIF(tbl_OPOVOON_P2Cop[Copayment],\">=\"&BM92,tbl_OPOVOON_P2Cop[Portion])>0.5,BM92,\"\"))","v":""},{"$f":"IF(COUNTIF(tbl_OPOVOON_P2Cop[Copayment],tbl_OPOVOON_P2Cop[[#This Row],[Copayment]])>1,\"Remove Duplicate Entry.\",IF(AND(tbl_OPOVOON_P2Cop[[#This Row],[Copayment]]<>\"\",tbl_OPOVOON_P2Cop[[#This Row],[Allowed Claims]]=0),\"Entry not found in Part 1 Table\",IF(AND(OFFSET(tbl_OPOVOON_P2Cop[[#This Row],[Copayment]],1,0)<>\"Total\",OFFSET(tbl_OPOVOON_P2Cop[[#This Row],[Copayment]],1,0)<>\"\",OFFSET(tbl_OPOVOON_P2Cop[[#This Row],[Copayment]],1,0)<tbl_OPOVOON_P2Cop[[#This Row],[Copayment]]),\"Sort Entries from lowest to highest\",\"\")))","v":""},null,null,null,null,null,{"$f":"SUMIF(tbl_OPAOOON_P1[Copayment],BV92,tbl_OPAOOON_P1[Plan Projected Allowed Amount])","v":0},{"$f":"IF(OR(BW92=0,BW92=\"\"),\"\",BW92/tbl_OPAOOON_P2Cop[[#Totals],[Allowed Claims]])","v":""},{"$f":"IF(BX92=\"\",\"\",IF(SUMIF(tbl_OPAOOON_P2Cop[Copayment],\">=\"&BV92,tbl_OPAOOON_P2Cop[Portion])>0.5,BV92,\"\"))","v":""},{"$f":"IF(COUNTIF(tbl_OPAOOON_P2Cop[Copayment],tbl_OPAOOON_P2Cop[[#This Row],[Copayment]])>1,\"Remove Duplicate Entry.\",IF(AND(tbl_OPAOOON_P2Cop[[#This Row],[Copayment]]<>\"\",tbl_OPAOOON_P2Cop[[#This Row],[Allowed Claims]]=0),\"Entry not found in Part 1 Table\",IF(AND(OFFSET(tbl_OPAOOON_P2Cop[[#This Row],[Copayment]],1,0)<>\"Total\",OFFSET(tbl_OPAOOON_P2Cop[[#This Row],[Copayment]],1,0)<>\"\",OFFSET(tbl_OPAOOON_P2Cop[[#This Row],[Copayment]],1,0)<tbl_OPAOOON_P2Cop[[#This Row],[Copayment]]),\"Sort Entries from lowest to highest\",\"\")))","v":""},null,null,null,null,null,{"$f":"SUMIF(tbl_ER_P1[Copayment],CE92,tbl_ER_P1[Plan Projected Allowed Amount])","v":0},{"$f":"IF(OR(CF92=0,CF92=\"\"),\"\",CF92/tbl_ER_P2Cop[[#Totals],[Allowed Claims]])","v":""},{"$f":"IF(CG92=\"\",\"\",IF(SUMIF(tbl_ER_P2Cop[Copayment],\">=\"&CE92,tbl_ER_P2Cop[Portion])>0.5,CE92,\"\"))","v":""},{"$f":"IF(COUNTIF(tbl_ER_P2Cop[Copayment],tbl_ER_P2Cop[[#This Row],[Copayment]])>1,\"Remove Duplicate Entry.\",IF(AND(tbl_ER_P2Cop[[#This Row],[Copayment]]<>\"\",tbl_ER_P2Cop[[#This Row],[Allowed Claims]]=0),\"Entry not found in Part 1 Table\",IF(AND(OFFSET(tbl_ER_P2Cop[[#This Row],[Copayment]],1,0)<>\"Total\",OFFSET(tbl_ER_P2Cop[[#This Row],[Copayment]],1,0)<>\"\",OFFSET(tbl_ER_P2Cop[[#This Row],[Copayment]],1,0)<tbl_ER_P2Cop[[#This Row],[Copayment]]),\"Sort Entries from lowest to highest\",\"\")))","v":""},null,null,null,null,null,{"$f":"SUMIF(tbl_RX_P1[Copayment],CN92,tbl_RX_P1[Plan Projected Allowed Amount])","v":0},{"$f":"IF(OR(CO92=0,CO92=\"\"),\"\",CO92/tbl_RX_P2Cop[[#Totals],[Allowed Claims]])","v":""},{"$f":"IF(CP92=\"\",\"\",IF(SUMIF(tbl_RX_P2Cop[Copayment],\">=\"&CN92,tbl_RX_P2Cop[Portion])>0.5,CN92,\"\"))","v":""},{"$f":"IF(COUNTIF(tbl_RX_P2Cop[Copayment],tbl_RX_P2Cop[[#This Row],[Copayment]])>1,\"Remove Duplicate Entry.\",IF(AND(tbl_RX_P2Cop[[#This Row],[Copayment]]<>\"\",tbl_RX_P2Cop[[#This Row],[Allowed Claims]]=0),\"Entry not found in Part 1 Table\",IF(AND(OFFSET(tbl_RX_P2Cop[[#This Row],[Copayment]],1,0)<>\"Total\",OFFSET(tbl_RX_P2Cop[[#This Row],[Copayment]],1,0)<>\"\",OFFSET(tbl_RX_P2Cop[[#This Row],[Copayment]],1,0)<tbl_RX_P2Cop[[#This Row],[Copayment]]),\"Sort Entries from lowest to highest\",\"\")))","v":""}]
[null,null,null,null,null,null,null,null,null,null,null,{"$f":"SUMIF(tbl_IPINN_P1[Copayment],K93,tbl_IPINN_P1[Plan Projected Allowed Amount])","v":0},{"$f":"IF(OR(L93=0,L93=\"\"),\"\",L93/tbl_IPINN_P2Cop[[#Totals],[Allowed Claims]])","v":""},{"$f":"IF(M93=\"\",\"\",IF(SUMIF(tbl_IPINN_P2Cop[Copayment],\">=\"&K93,tbl_IPINN_P2Cop[Portion])>0.5,K93,\"\"))","v":""},{"$f":"IF(COUNTIF(tbl_IPINN_P2Cop[Copayment],tbl_IPINN_P2Cop[[#This Row],[Copayment]])>1,\"Remove Duplicate Entry.\",IF(AND(tbl_IPINN_P2Cop[[#This Row],[Copayment]]<>\"\",tbl_IPINN_P2Cop[[#This Row],[Allowed Claims]]=0),\"Entry not found in Part 1 Table\",IF(AND(OFFSET(tbl_IPINN_P2Cop[[#This Row],[Copayment]],1,0)<>\"Total\",OFFSET(tbl_IPINN_P2Cop[[#This Row],[Copayment]],1,0)<>\"\",OFFSET(tbl_IPINN_P2Cop[[#This Row],[Copayment]],1,0)<tbl_IPINN_P2Cop[[#This Row],[Copayment]]),\"Sort Entries from lowest to highest\",\"\")))","v":""},null,null,null,null,null,{"$f":"SUMIF(tbl_IPOON_P1[Copayment],T93,tbl_IPOON_P1[Plan Projected Allowed Amount])","v":0},{"$f":"IF(OR(U93=0,U93=\"\"),\"\",U93/tbl_IPOON_P2Cop[[#Totals],[Allowed Claims]])","v":""},{"$f":"IF(V93=\"\",\"\",IF(SUMIF(tbl_IPOON_P2Cop[Copayment],\">=\"&T93,tbl_IPOON_P2Cop[Portion])>0.5,T93,\"\"))","v":""},{"$f":"IF(COUNTIF(tbl_IPOON_P2Cop[Copayment],tbl_IPOON_P2Cop[[#This Row],[Copayment]])>1,\"Remove Duplicate Entry.\",IF(AND(tbl_IPOON_P2Cop[[#This Row],[Copayment]]<>\"\",tbl_IPOON_P2Cop[[#This Row],[Allowed Claims]]=0),\"Entry not found in Part 1 Table\",IF(AND(OFFSET(tbl_IPOON_P2Cop[[#This Row],[Copayment]],1,0)<>\"Total\",OFFSET(tbl_IPOON_P2Cop[[#This Row],[Copayment]],1,0)<>\"\",OFFSET(tbl_IPOON_P2Cop[[#This Row],[Copayment]],1,0)<tbl_IPOON_P2Cop[[#This Row],[Copayment]]),\"Sort Entries from lowest to highest\",\"\")))","v":""},null,null,null,null,null,{"$f":"SUMIF(tbl_OPINN_P1[Copayment],AC93,tbl_OPINN_P1[Plan Projected Allowed Amount])","v":0},{"$f":"IF(OR(AD93=0,AD93=\"\"),\"\",AD93/tbl_OPINN_P2Cop[[#Totals],[Allowed Claims]])","v":""},{"$f":"IF(AE93=\"\",\"\",IF(SUMIF(tbl_OPINN_P2Cop[Copayment],\">=\"&AC93,tbl_OPINN_P2Cop[Portion])>0.5,AC93,\"\"))","v":""},{"$f":"IF(COUNTIF(tbl_OPINN_P2Cop[Copayment],tbl_OPINN_P2Cop[[#This Row],[Copayment]])>1,\"Remove Duplicate Entry.\",IF(AND(tbl_OPINN_P2Cop[[#This Row],[Copayment]]<>\"\",tbl_OPINN_P2Cop[[#This Row],[Allowed Claims]]=0),\"Entry not found in Part 1 Table\",IF(AND(OFFSET(tbl_OPINN_P2Cop[[#This Row],[Copayment]],1,0)<>\"Total\",OFFSET(tbl_OPINN_P2Cop[[#This Row],[Copayment]],1,0)<>\"\",OFFSET(tbl_OPINN_P2Cop[[#This Row],[Copayment]],1,0)<tbl_OPINN_P2Cop[[#This Row],[Copayment]]),\"Sort Entries from lowest to highest\",\"\")))","v":""},null,null,null,null,null,{"$f":"SUMIF(tbl_OPOVINN_P1[Copayment],AL93,tbl_OPOVINN_P1[Plan Projected Allowed Amount])","v":0},{"$f":"IF(OR(AM93=0,AM93=\"\"),\"\",AM93/tbl_OPOVINN_P2Cop[[#Totals],[Allowed Claims]])","v":""},{"$f":"IF(AN93=\"\",\"\",IF(SUMIF(tbl_OPOVINN_P2Cop[Copayment],\">=\"&AL93,tbl_OPOVINN_P2Cop[Portion])>0.5,AL93,\"\"))","v":""},{"$f":"IF(COUNTIF(tbl_OPOVINN_P2Cop[Copayment],tbl_OPOVINN_P2Cop[[#This Row],[Copayment]])>1,\"Remove Duplicate Entry.\",IF(AND(tbl_OPOVINN_P2Cop[[#This Row],[Copayment]]<>\"\",tbl_OPOVINN_P2Cop[[#This Row],[Allowed Claims]]=0),\"Entry not found in Part 1 Table\",IF(AND(OFFSET(tbl_OPOVINN_P2Cop[[#This Row],[Copayment]],1,0)<>\"Total\",OFFSET(tbl_OPOVINN_P2Cop[[#This Row],[Copayment]],1,0)<>\"\",OFFSET(tbl_OPOVINN_P2Cop[[#This Row],[Copayment]],1,0)<tbl_OPOVINN_P2Cop[[#This Row],[Copayment]]),\"Sort Entries from lowest to highest\",\"\")))","v":""},null,null,null,null,null,{"$f":"SUMIF(tbl_OPAOINN_P1[Copayment],AU93,tbl_OPAOINN_P1[Plan Projected Allowed Amount])","v":0},{"$f":"IF(OR(AV93=0,AV93=\"\"),\"\",AV93/tbl_OPAOINN_P2Cop[[#Totals],[Allowed Claims]])","v":""},{"$f":"IF(AW93=\"\",\"\",IF(SUMIF(tbl_OPAOINN_P2Cop[Copayment],\">=\"&AU93,tbl_OPAOINN_P2Cop[Portion])>0.5,AU93,\"\"))","v":""},{"$f":"IF(COUNTIF(tbl_OPAOINN_P2Cop[Copayment],tbl_OPAOINN_P2Cop[[#This Row],[Copayment]])>1,\"Remove Duplicate Entry.\",IF(AND(tbl_OPAOINN_P2Cop[[#This Row],[Copayment]]<>\"\",tbl_OPAOINN_P2Cop[[#This Row],[Allowed Claims]]=0),\"Entry not found in Part 1 Table\",IF(AND(OFFSET(tbl_OPAOINN_P2Cop[[#This Row],[Copayment]],1,0)<>\"Total\",OFFSET(tbl_OPAOINN_P2Cop[[#This Row],[Copayment]],1,0)<>\"\",OFFSET(tbl_OPAOINN_P2Cop[[#This Row],[Copayment]],1,0)<tbl_OPAOINN_P2Cop[[#This Row],[Copayment]]),\"Sort Entries from lowest to highest\",\"\")))","v":""},null,null,null,null,null,{"$f":"SUMIF(tbl_OPOON_P1[Copayment],BD93,tbl_OPOON_P1[Plan Projected Allowed Amount])","v":0},{"$f":"IF(OR(BE93=0,BE93=\"\"),\"\",BE93/tbl_OPOON_P2Cop[[#Totals],[Allowed Claims]])","v":""},{"$f":"IF(BF93=\"\",\"\",IF(SUMIF(tbl_OPOON_P2Cop[Copayment],\">=\"&BD93,tbl_OPOON_P2Cop[Portion])>0.5,BD93,\"\"))","v":""},{"$f":"IF(COUNTIF(tbl_OPOON_P2Cop[Copayment],tbl_OPOON_P2Cop[[#This Row],[Copayment]])>1,\"Remove Duplicate Entry.\",IF(AND(tbl_OPOON_P2Cop[[#This Row],[Copayment]]<>\"\",tbl_OPOON_P2Cop[[#This Row],[Allowed Claims]]=0),\"Entry not found in Part 1 Table\",IF(AND(OFFSET(tbl_OPOON_P2Cop[[#This Row],[Copayment]],1,0)<>\"Total\",OFFSET(tbl_OPOON_P2Cop[[#This Row],[Copayment]],1,0)<>\"\",OFFSET(tbl_OPOON_P2Cop[[#This Row],[Copayment]],1,0)<tbl_OPOON_P2Cop[[#This Row],[Copayment]]),\"Sort Entries from lowest to highest\",\"\")))","v":""},null,null,null,null,null,{"$f":"SUMIF(tbl_OPOVOON_P1[Copayment],BM93,tbl_OPOVOON_P1[Plan Projected Allowed Amount])","v":0},{"$f":"IF(OR(BN93=0,BN93=\"\"),\"\",BN93/tbl_OPOVOON_P2Cop[[#Totals],[Allowed Claims]])","v":""},{"$f":"IF(BO93=\"\",\"\",IF(SUMIF(tbl_OPOVOON_P2Cop[Copayment],\">=\"&BM93,tbl_OPOVOON_P2Cop[Portion])>0.5,BM93,\"\"))","v":""},{"$f":"IF(COUNTIF(tbl_OPOVOON_P2Cop[Copayment],tbl_OPOVOON_P2Cop[[#This Row],[Copayment]])>1,\"Remove Duplicate Entry.\",IF(AND(tbl_OPOVOON_P2Cop[[#This Row],[Copayment]]<>\"\",tbl_OPOVOON_P2Cop[[#This Row],[Allowed Claims]]=0),\"Entry not found in Part 1 Table\",IF(AND(OFFSET(tbl_OPOVOON_P2Cop[[#This Row],[Copayment]],1,0)<>\"Total\",OFFSET(tbl_OPOVOON_P2Cop[[#This Row],[Copayment]],1,0)<>\"\",OFFSET(tbl_OPOVOON_P2Cop[[#This Row],[Copayment]],1,0)<tbl_OPOVOON_P2Cop[[#This Row],[Copayment]]),\"Sort Entries from lowest to highest\",\"\")))","v":""},null,null,null,null,null,{"$f":"SUMIF(tbl_OPAOOON_P1[Copayment],BV93,tbl_OPAOOON_P1[Plan Projected Allowed Amount])","v":0},{"$f":"IF(OR(BW93=0,BW93=\"\"),\"\",BW93/tbl_OPAOOON_P2Cop[[#Totals],[Allowed Claims]])","v":""},{"$f":"IF(BX93=\"\",\"\",IF(SUMIF(tbl_OPAOOON_P2Cop[Copayment],\">=\"&BV93,tbl_OPAOOON_P2Cop[Portion])>0.5,BV93,\"\"))","v":""},{"$f":"IF(COUNTIF(tbl_OPAOOON_P2Cop[Copayment],tbl_OPAOOON_P2Cop[[#This Row],[Copayment]])>1,\"Remove Duplicate Entry.\",IF(AND(tbl_OPAOOON_P2Cop[[#This Row],[Copayment]]<>\"\",tbl_OPAOOON_P2Cop[[#This Row],[Allowed Claims]]=0),\"Entry not found in Part 1 Table\",IF(AND(OFFSET(tbl_OPAOOON_P2Cop[[#This Row],[Copayment]],1,0)<>\"Total\",OFFSET(tbl_OPAOOON_P2Cop[[#This Row],[Copayment]],1,0)<>\"\",OFFSET(tbl_OPAOOON_P2Cop[[#This Row],[Copayment]],1,0)<tbl_OPAOOON_P2Cop[[#This Row],[Copayment]]),\"Sort Entries from lowest to highest\",\"\")))","v":""},null,null,null,null,null,{"$f":"SUMIF(tbl_ER_P1[Copayment],CE93,tbl_ER_P1[Plan Projected Allowed Amount])","v":0},{"$f":"IF(OR(CF93=0,CF93=\"\"),\"\",CF93/tbl_ER_P2Cop[[#Totals],[Allowed Claims]])","v":""},{"$f":"IF(CG93=\"\",\"\",IF(SUMIF(tbl_ER_P2Cop[Copayment],\">=\"&CE93,tbl_ER_P2Cop[Portion])>0.5,CE93,\"\"))","v":""},{"$f":"IF(COUNTIF(tbl_ER_P2Cop[Copayment],tbl_ER_P2Cop[[#This Row],[Copayment]])>1,\"Remove Duplicate Entry.\",IF(AND(tbl_ER_P2Cop[[#This Row],[Copayment]]<>\"\",tbl_ER_P2Cop[[#This Row],[Allowed Claims]]=0),\"Entry not found in Part 1 Table\",IF(AND(OFFSET(tbl_ER_P2Cop[[#This Row],[Copayment]],1,0)<>\"Total\",OFFSET(tbl_ER_P2Cop[[#This Row],[Copayment]],1,0)<>\"\",OFFSET(tbl_ER_P2Cop[[#This Row],[Copayment]],1,0)<tbl_ER_P2Cop[[#This Row],[Copayment]]),\"Sort Entries from lowest to highest\",\"\")))","v":""},null,null,null,null,null,{"$f":"SUMIF(tbl_RX_P1[Copayment],CN93,tbl_RX_P1[Plan Projected Allowed Amount])","v":0},{"$f":"IF(OR(CO93=0,CO93=\"\"),\"\",CO93/tbl_RX_P2Cop[[#Totals],[Allowed Claims]])","v":""},{"$f":"IF(CP93=\"\",\"\",IF(SUMIF(tbl_RX_P2Cop[Copayment],\">=\"&CN93,tbl_RX_P2Cop[Portion])>0.5,CN93,\"\"))","v":""},{"$f":"IF(COUNTIF(tbl_RX_P2Cop[Copayment],tbl_RX_P2Cop[[#This Row],[Copayment]])>1,\"Remove Duplicate Entry.\",IF(AND(tbl_RX_P2Cop[[#This Row],[Copayment]]<>\"\",tbl_RX_P2Cop[[#This Row],[Allowed Claims]]=0),\"Entry not found in Part 1 Table\",IF(AND(OFFSET(tbl_RX_P2Cop[[#This Row],[Copayment]],1,0)<>\"Total\",OFFSET(tbl_RX_P2Cop[[#This Row],[Copayment]],1,0)<>\"\",OFFSET(tbl_RX_P2Cop[[#This Row],[Copayment]],1,0)<tbl_RX_P2Cop[[#This Row],[Copayment]]),\"Sort Entries from lowest to highest\",\"\")))","v":""}]
[null,null,null,null,null,null,null,null,null,null,"Total",{"$f":"SUBTOTAL(109,tbl_IPINN_P2Cop[Allowed Claims])","v":0},{"$f":"SUBTOTAL(109,tbl_IPINN_P2Cop[Portion])","v":0},null,{"$f":"IF(AND(tbl_IPINN_P2Cop[[#Totals],[Allowed Claims]]<L70,N70<>\"Fail\",N70<>\"N/A\"),\"Add missing cost share values.\",IF(L94>M55,\"Allowed claims higher than possible; correct entries.\",\"\"))","v":""},null,null,null,null,"Total",{"$f":"SUBTOTAL(109,tbl_IPOON_P2Cop[Allowed Claims])","v":0},{"$f":"SUBTOTAL(109,tbl_IPOON_P2Cop[Portion])","v":0},null,{"$f":"IF(AND(tbl_IPOON_P2Cop[[#Totals],[Allowed Claims]]<U70,W70<>\"Fail\",W70<>\"N/A\"),\"Add missing cost share values.\",IF(U94>V55,\"Allowed claims higher than possible; correct entries.\",\"\"))","v":""},null,null,null,null,"Total",{"$f":"SUBTOTAL(109,tbl_OPINN_P2Cop[Allowed Claims])","v":0},{"$f":"SUBTOTAL(109,tbl_OPINN_P2Cop[Portion])","v":0},null,{"$f":"IF(AND(tbl_OPINN_P2Cop[[#Totals],[Allowed Claims]]<AD70,AF70<>\"Fail\",AF70<>\"N/A\"),\"Add missing cost share values.\",IF(AD94>AE55,\"Allowed claims higher than possible; correct entries.\",\"\"))","v":""},null,null,null,null,"Total",{"$f":"SUBTOTAL(109,tbl_OPOVINN_P2Cop[Allowed Claims])","v":0},{"$f":"SUBTOTAL(109,tbl_OPOVINN_P2Cop[Portion])","v":0},null,{"$f":"IF(AND(tbl_OPOVINN_P2Cop[[#Totals],[Allowed Claims]]<AM70,AO70<>\"Fail\",AO70<>\"N/A\"),\"Add missing cost share values.\",IF(AM94>AN55,\"Allowed claims higher than possible; correct entries.\",\"\"))","v":""},null,null,null,null,"Total",{"$f":"SUBTOTAL(109,tbl_OPAOINN_P2Cop[Allowed Claims])","v":0},{"$f":"SUBTOTAL(109,tbl_OPAOINN_P2Cop[Portion])","v":0},null,{"$f":"IF(AND(tbl_OPAOINN_P2Cop[[#Totals],[Allowed Claims]]<AV70,AX70<>\"Fail\",AX70<>\"N/A\"),\"Add missing cost share values.\",IF(AV94>AW55,\"Allowed claims higher than possible; correct entries.\",\"\"))","v":""},null,null,null,null,"Total",{"$f":"SUBTOTAL(109,tbl_OPOON_P2Cop[Allowed Claims])","v":0},{"$f":"SUBTOTAL(109,tbl_OPOON_P2Cop[Portion])","v":0},null,{"$f":"IF(AND(tbl_OPOON_P2Cop[[#Totals],[Allowed Claims]]<BE70,BG70<>\"Fail\",BG70<>\"N/A\"),\"Add missing cost share values.\",IF(BE94>BF55,\"Allowed claims higher than possible; correct entries.\",\"\"))","v":""},null,null,null,null,"Total",{"$f":"SUBTOTAL(109,tbl_OPOVOON_P2Cop[Allowed Claims])","v":0},{"$f":"SUBTOTAL(109,tbl_OPOVOON_P2Cop[Portion])","v":0},null,{"$f":"IF(AND(tbl_OPOVOON_P2Cop[[#Totals],[Allowed Claims]]<BN70,BP70<>\"Fail\",BP70<>\"N/A\"),\"Add missing cost share values.\",IF(BN94>BO55,\"Allowed claims higher than possible; correct entries.\",\"\"))","v":""},null,null,null,null,"Total",{"$f":"SUBTOTAL(109,tbl_OPAOOON_P2Cop[Allowed Claims])","v":0},{"$f":"SUBTOTAL(109,tbl_OPAOOON_P2Cop[Portion])","v":0},null,{"$f":"IF(AND(tbl_OPAOOON_P2Cop[[#Totals],[Allowed Claims]]<BW70,BY70<>\"Fail\",BY70<>\"N/A\"),\"Add missing cost share values.\",IF(BW94>BX55,\"Allowed claims higher than possible; correct entries.\",\"\"))","v":""},null,null,null,null,"Total",{"$f":"SUBTOTAL(109,tbl_ER_P2Cop[Allowed Claims])","v":0},{"$f":"SUBTOTAL(109,tbl_ER_P2Cop[Portion])","v":0},null,{"$f":"IF(AND(tbl_ER_P2Cop[[#Totals],[Allowed Claims]]<CF70,CH70<>\"Fail\",CH70<>\"N/A\"),\"Add missing cost share values.\",IF(CF94>CG55,\"Allowed claims higher than possible; correct entries.\",\"\"))","v":""},null,null,null,null,"Total",{"$f":"SUBTOTAL(109,tbl_RX_P2Cop[Allowed Claims])","v":0},{"$f":"SUBTOTAL(109,tbl_RX_P2Cop[Portion])","v":0},null,{"$f":"IF(AND(tbl_RX_P2Cop[[#Totals],[Allowed Claims]]<CO70,CQ70<>\"Fail\",CQ70<>\"N/A\"),\"Add missing cost share values.\",IF(CO94>CP55,\"Allowed claims higher than possible; correct entries.\",\"\"))","v":""}]
[]
[null,null,null,null,null,null,null,null,null,null,{"$f":"K100&\" ---- \"&L$40","v":"Coinsurance ---- (1) Inpatient, In-Network (IP INN)"},null,null,"Errors found:",{"$f":"COUNTIF(tbl_IPINN_P2Coi[[#Data],[#Totals],[Error Checking]],\"?*\")","v":0},null,null,null,null,{"$f":"T100&\" ---- \"&U$40","v":"Coinsurance ---- (2) Inpatient, Out-of-Network (IP OON)"},null,null,"Errors found:",{"$f":"COUNTIF(tbl_IPOON_P2Coi[[#Data],[#Totals],[Error Checking]],\"?*\")","v":0},null,null,null,null,{"$f":"AC100&\" ---- \"&AD$40","v":"Coinsurance ---- (3) Outpatient, In-Network (OP INN)"},null,null,"Errors found:",{"$f":"COUNTIF(tbl_OPINN_P2Coi[[#Data],[#Totals],[Error Checking]],\"?*\")","v":0},null,null,null,null,{"$f":"AL100&\" ---- \"&AM$40","v":"Coinsurance ---- (3a) Outpatient - Office Visits, In-Network (OP-OV INN)"},null,null,"Errors found:",{"$f":"COUNTIF(tbl_OPOVINN_P2Coi[[#Data],[#Totals],[Error Checking]],\"?*\")","v":0},null,null,null,null,{"$f":"AU100&\" ---- \"&AV$40","v":"Coinsurance ---- (3b) Outpatient - All Other, In-Network (OP-AO INN)"},null,null,"Errors found:",{"$f":"COUNTIF(tbl_OPAOINN_P2Coi[[#Data],[#Totals],[Error Checking]],\"?*\")","v":0},null,null,null,null,{"$f":"BD100&\" ---- \"&BE$40","v":"Coinsurance ---- (4) Outpatient, Out-of-Network (OP OON)"},null,null,"Errors found:",{"$f":"COUNTIF(tbl_OPOON_P2Coi[[#Data],[#Totals],[Error Checking]],\"?*\")","v":0},null,null,null,null,{"$f":"BM100&\" ---- \"&BN$40","v":"Coinsurance ---- (4a) Outpatient - Office Visits, Out-of-Network (OP-OV OON)"},null,null,"Errors found:",{"$f":"COUNTIF(tbl_OPOVOON_P2Coi[[#Data],[#Totals],[Error Checking]],\"?*\")","v":0},null,null,null,null,{"$f":"BV100&\" ---- \"&BW$40","v":"Coinsurance ---- (4b) Outpatient - All Other, Out-of-Network (OP-AO OON)"},null,null,"Errors found:",{"$f":"COUNTIF(tbl_OPAOOON_P2Coi[[#Data],[#Totals],[Error Checking]],\"?*\")","v":0},null,null,null,null,{"$f":"CE100&\" ---- \"&CF$40","v":"Coinsurance ---- (5) Emergency Care,  (ER )"},null,null,"Errors found:",{"$f":"COUNTIF(tbl_ER_P2Coi[[#Data],[#Totals],[Error Checking]],\"?*\")","v":0},null,null,null,null,{"$f":"CN100&\" ---- \"&CO$40","v":"Coinsurance ---- (6) Prescription Drugs,  (RX )"},null,null,"Errors found:",{"$f":"COUNTIF(tbl_RX_P2Coi[[#Data],[#Totals],[Error Checking]],\"?*\")","v":0}]
[null,null,null,null,null,null,null,null,null,null,{"$f":"IF(INDEX(M$69:M$72,MATCH(K100,K$69:K$72,0))=\"\",\"If testing is required for this benefit classification: \nPlease ensure each different cost-share combination is entered above in PART 1.\",IF(INDEX(M$69:M$72,MATCH(K100,K$69:K$72,0))>=(2/3),\"Applies to substantially all medical/surgical benefits in this classification.\nENTER different \"&LOWER(K100)&\" amounts from smallest to largest.\",\"Does not apply to substantially all medical/surgical benefits in this classification. \nDELETE any values in the left-hand column below.\"))","v":"If testing is required for this benefit classification: \nPlease ensure each different cost-share combination is entered above in PART 1."},null,null,null,null,null,null,null,null,{"$f":"IF(INDEX(V$69:V$72,MATCH(T100,T$69:T$72,0))=\"\",\"If testing is required for this benefit classification: \nPlease ensure each different cost-share combination is entered above in PART 1.\",IF(INDEX(V$69:V$72,MATCH(T100,T$69:T$72,0))>=(2/3),\"Applies to substantially all medical/surgical benefits in this classification.\nENTER different \"&LOWER(T100)&\" amounts from smallest to largest.\",\"Does not apply to substantially all medical/surgical benefits in this classification. \nDELETE any values in the left-hand column below.\"))","v":"If testing is required for this benefit classification: \nPlease ensure each different cost-share combination is entered above in PART 1."},null,null,null,null,null,null,null,null,{"$f":"IF(INDEX(AE$69:AE$72,MATCH(AC100,AC$69:AC$72,0))=\"\",\"If testing is required for this benefit classification: \nPlease ensure each different cost-share combination is entered above in PART 1.\",IF(INDEX(AE$69:AE$72,MATCH(AC100,AC$69:AC$72,0))>=(2/3),\"Applies to substantially all medical/surgical benefits in this classification.\nENTER different \"&LOWER(AC100)&\" amounts from smallest to largest.\",\"Does not apply to substantially all medical/surgical benefits in this classification. \nDELETE any values in the left-hand column below.\"))","v":"If testing is required for this benefit classification: \nPlease ensure each different cost-share combination is entered above in PART 1."},null,null,null,null,null,null,null,null,{"$f":"IF(INDEX(AN$69:AN$72,MATCH(AL100,AL$69:AL$72,0))=\"\",\"If testing is required for this benefit classification: \nPlease ensure each different cost-share combination is entered above in PART 1.\",IF(INDEX(AN$69:AN$72,MATCH(AL100,AL$69:AL$72,0))>=(2/3),\"Applies to substantially all medical/surgical benefits in this classification.\nENTER different \"&LOWER(AL100)&\" amounts from smallest to largest.\",\"Does not apply to substantially all medical/surgical benefits in this classification. \nDELETE any values in the left-hand column below.\"))","v":"If testing is required for this benefit classification: \nPlease ensure each different cost-share combination is entered above in PART 1."},null,null,null,null,null,null,null,null,{"$f":"IF(INDEX(AW$69:AW$72,MATCH(AU100,AU$69:AU$72,0))=\"\",\"If testing is required for this benefit classification: \nPlease ensure each different cost-share combination is entered above in PART 1.\",IF(INDEX(AW$69:AW$72,MATCH(AU100,AU$69:AU$72,0))>=(2/3),\"Applies to substantially all medical/surgical benefits in this classification.\nENTER different \"&LOWER(AU100)&\" amounts from smallest to largest.\",\"Does not apply to substantially all medical/surgical benefits in this classification. \nDELETE any values in the left-hand column below.\"))","v":"If testing is required for this benefit classification: \nPlease ensure each different cost-share combination is entered above in PART 1."},null,null,null,null,null,null,null,null,{"$f":"IF(INDEX(BF$69:BF$72,MATCH(BD100,BD$69:BD$72,0))=\"\",\"If testing is required for this benefit classification: \nPlease ensure each different cost-share combination is entered above in PART 1.\",IF(INDEX(BF$69:BF$72,MATCH(BD100,BD$69:BD$72,0))>=(2/3),\"Applies to substantially all medical/surgical benefits in this classification.\nENTER different \"&LOWER(BD100)&\" amounts from smallest to largest.\",\"Does not apply to substantially all medical/surgical benefits in this classification. \nDELETE any values in the left-hand column below.\"))","v":"If testing is required for this benefit classification: \nPlease ensure each different cost-share combination is entered above in PART 1."},null,null,null,null,null,null,null,null,{"$f":"IF(INDEX(BO$69:BO$72,MATCH(BM100,BM$69:BM$72,0))=\"\",\"If testing is required for this benefit classification: \nPlease ensure each different cost-share combination is entered above in PART 1.\",IF(INDEX(BO$69:BO$72,MATCH(BM100,BM$69:BM$72,0))>=(2/3),\"Applies to substantially all medical/surgical benefits in this classification.\nENTER different \"&LOWER(BM100)&\" amounts from smallest to largest.\",\"Does not apply to substantially all medical/surgical benefits in this classification. \nDELETE any values in the left-hand column below.\"))","v":"If testing is required for this benefit classification: \nPlease ensure each different cost-share combination is entered above in PART 1."},null,null,null,null,null,null,null,null,{"$f":"IF(INDEX(BX$69:BX$72,MATCH(BV100,BV$69:BV$72,0))=\"\",\"If testing is required for this benefit classification: \nPlease ensure each different cost-share combination is entered above in PART 1.\",IF(INDEX(BX$69:BX$72,MATCH(BV100,BV$69:BV$72,0))>=(2/3),\"Applies to substantially all medical/surgical benefits in this classification.\nENTER different \"&LOWER(BV100)&\" amounts from smallest to largest.\",\"Does not apply to substantially all medical/surgical benefits in this classification. \nDELETE any values in the left-hand column below.\"))","v":"If testing is required for this benefit classification: \nPlease ensure each different cost-share combination is entered above in PART 1."},null,null,null,null,null,null,null,null,{"$f":"IF(INDEX(CG$69:CG$72,MATCH(CE100,CE$69:CE$72,0))=\"\",\"If testing is required for this benefit classification: \nPlease ensure each different cost-share combination is entered above in PART 1.\",IF(INDEX(CG$69:CG$72,MATCH(CE100,CE$69:CE$72,0))>=(2/3),\"Applies to substantially all medical/surgical benefits in this classification.\nENTER different \"&LOWER(CE100)&\" amounts from smallest to largest.\",\"Does not apply to substantially all medical/surgical benefits in this classification. \nDELETE any values in the left-hand column below.\"))","v":"If testing is required for this benefit classification: \nPlease ensure each different cost-share combination is entered above in PART 1."},null,null,null,null,null,null,null,null,{"$f":"IF(INDEX(CP$69:CP$72,MATCH(CN100,CN$69:CN$72,0))=\"\",\"If testing is required for this benefit classification: \nPlease ensure each different cost-share combination is entered above in PART 1.\",IF(INDEX(CP$69:CP$72,MATCH(CN100,CN$69:CN$72,0))>=(2/3),\"Applies to substantially all medical/surgical benefits in this classification.\nENTER different \"&LOWER(CN100)&\" amounts from smallest to largest.\",\"Does not apply to substantially all medical/surgical benefits in this classification. \nDELETE any values in the left-hand column below.\"))","v":"If testing is required for this benefit classification: \nPlease ensure each different cost-share combination is entered above in PART 1."}]
[]
[]
[null,null,null,null,null,null,null,null,null,null,"Coinsurance","Allowed Claims","Portion","Predominant & Smaller","Error Checking",null,null,null,null,"Coinsurance","Allowed Claims","Portion","Predominant & Smaller","Error Checking",null,null,null,null,"Coinsurance","Allowed Claims","Portion","Predominant & Smaller","Error Checking",null,null,null,null,"Coinsurance","Allowed Claims","Portion","Predominant & Smaller","Error Checking",null,null,null,null,"Coinsurance","Allowed Claims","Portion","Predominant & Smaller","Error Checking",null,null,null,null,"Coinsurance","Allowed Claims","Portion","Predominant & Smaller","Error Checking",null,null,null,null,"Coinsurance","Allowed Claims","Portion","Predominant & Smaller","Error Checking",null,null,null,null,"Coinsurance","Allowed Claims","Portion","Predominant & Smaller","Error Checking",null,null,null,null,"Coinsurance","Allowed Claims","Portion","Predominant & Smaller","Error Checking",null,null,null,null,"Coinsurance","Allowed Claims","Portion","Predominant & Smaller","Error Checking"]
[null,null,null,null,null,null,null,null,null,null,null,{"$f":"SUMIF(tbl_IPINN_P1[Coinsurance],K101,tbl_IPINN_P1[Plan Projected Allowed Amount])","v":0},{"$f":"IF(OR(L101=0,L101=\"\"),\"\",L101/tbl_IPINN_P2Coi[[#Totals],[Allowed Claims]])","v":""},{"$f":"IF(M101=\"\",\"\",IF(SUMIF(tbl_IPINN_P2Coi[Coinsurance],\">=\"&K101,tbl_IPINN_P2Coi[Portion])>0.5,K101,\"\"))","v":""},{"$f":"IF(COUNTIF(tbl_IPINN_P2Coi[Coinsurance],tbl_IPINN_P2Coi[[#This Row],[Coinsurance]])>1,\"Remove Duplicate Entry.\",IF(AND(tbl_IPINN_P2Coi[[#This Row],[Coinsurance]]<>\"\",tbl_IPINN_P2Coi[[#This Row],[Allowed Claims]]=0),\"Entry not found in Part 1 Table\",IF(AND(OFFSET(tbl_IPINN_P2Coi[[#This Row],[Coinsurance]],1,0)<>\"Total\",OFFSET(tbl_IPINN_P2Coi[[#This Row],[Coinsurance]],1,0)<>\"\",OFFSET(tbl_IPINN_P2Coi[[#This Row],[Coinsurance]],1,0)<tbl_IPINN_P2Coi[[#This Row],[Coinsurance]]),\"Sort Entries from lowest to highest\",\"\")))","v":""},null,null,null,null,null,{"$f":"SUMIF(tbl_IPOON_P1[Coinsurance],T101,tbl_IPOON_P1[Plan Projected Allowed Amount])","v":0},{"$f":"IF(OR(U101=0,U101=\"\"),\"\",U101/tbl_IPOON_P2Coi[[#Totals],[Allowed Claims]])","v":""},{"$f":"IF(V101=\"\",\"\",IF(SUMIF(tbl_IPOON_P2Coi[Coinsurance],\">=\"&T101,tbl_IPOON_P2Coi[Portion])>0.5,T101,\"\"))","v":""},{"$f":"IF(COUNTIF(tbl_IPOON_P2Coi[Coinsurance],tbl_IPOON_P2Coi[[#This Row],[Coinsurance]])>1,\"Remove Duplicate Entry.\",IF(AND(tbl_IPOON_P2Coi[[#This Row],[Coinsurance]]<>\"\",tbl_IPOON_P2Coi[[#This Row],[Allowed Claims]]=0),\"Entry not found in Part 1 Table\",IF(AND(OFFSET(tbl_IPOON_P2Coi[[#This Row],[Coinsurance]],1,0)<>\"Total\",OFFSET(tbl_IPOON_P2Coi[[#This Row],[Coinsurance]],1,0)<>\"\",OFFSET(tbl_IPOON_P2Coi[[#This Row],[Coinsurance]],1,0)<tbl_IPOON_P2Coi[[#This Row],[Coinsurance]]),\"Sort Entries from lowest to highest\",\"\")))","v":""},null,null,null,null,null,{"$f":"SUMIF(tbl_OPINN_P1[Coinsurance],AC101,tbl_OPINN_P1[Plan Projected Allowed Amount])","v":0},{"$f":"IF(OR(AD101=0,AD101=\"\"),\"\",AD101/tbl_OPINN_P2Coi[[#Totals],[Allowed Claims]])","v":""},{"$f":"IF(AE101=\"\",\"\",IF(SUMIF(tbl_OPINN_P2Coi[Coinsurance],\">=\"&AC101,tbl_OPINN_P2Coi[Portion])>0.5,AC101,\"\"))","v":""},{"$f":"IF(COUNTIF(tbl_OPINN_P2Coi[Coinsurance],tbl_OPINN_P2Coi[[#This Row],[Coinsurance]])>1,\"Remove Duplicate Entry.\",IF(AND(tbl_OPINN_P2Coi[[#This Row],[Coinsurance]]<>\"\",tbl_OPINN_P2Coi[[#This Row],[Allowed Claims]]=0),\"Entry not found in Part 1 Table\",IF(AND(OFFSET(tbl_OPINN_P2Coi[[#This Row],[Coinsurance]],1,0)<>\"Total\",OFFSET(tbl_OPINN_P2Coi[[#This Row],[Coinsurance]],1,0)<>\"\",OFFSET(tbl_OPINN_P2Coi[[#This Row],[Coinsurance]],1,0)<tbl_OPINN_P2Coi[[#This Row],[Coinsurance]]),\"Sort Entries from lowest to highest\",\"\")))","v":""},null,null,null,null,null,{"$f":"SUMIF(tbl_OPOVINN_P1[Coinsurance],AL101,tbl_OPOVINN_P1[Plan Projected Allowed Amount])","v":0},{"$f":"IF(OR(AM101=0,AM101=\"\"),\"\",AM101/tbl_OPOVINN_P2Coi[[#Totals],[Allowed Claims]])","v":""},{"$f":"IF(AN101=\"\",\"\",IF(SUMIF(tbl_OPOVINN_P2Coi[Coinsurance],\">=\"&AL101,tbl_OPOVINN_P2Coi[Portion])>0.5,AL101,\"\"))","v":""},{"$f":"IF(COUNTIF(tbl_OPOVINN_P2Coi[Coinsurance],tbl_OPOVINN_P2Coi[[#This Row],[Coinsurance]])>1,\"Remove Duplicate Entry.\",IF(AND(tbl_OPOVINN_P2Coi[[#This Row],[Coinsurance]]<>\"\",tbl_OPOVINN_P2Coi[[#This Row],[Allowed Claims]]=0),\"Entry not found in Part 1 Table\",IF(AND(OFFSET(tbl_OPOVINN_P2Coi[[#This Row],[Coinsurance]],1,0)<>\"Total\",OFFSET(tbl_OPOVINN_P2Coi[[#This Row],[Coinsurance]],1,0)<>\"\",OFFSET(tbl_OPOVINN_P2Coi[[#This Row],[Coinsurance]],1,0)<tbl_OPOVINN_P2Coi[[#This Row],[Coinsurance]]),\"Sort Entries from lowest to highest\",\"\")))","v":""},null,null,null,null,null,{"$f":"SUMIF(tbl_OPAOINN_P1[Coinsurance],AU101,tbl_OPAOINN_P1[Plan Projected Allowed Amount])","v":0},{"$f":"IF(OR(AV101=0,AV101=\"\"),\"\",AV101/tbl_OPAOINN_P2Coi[[#Totals],[Allowed Claims]])","v":""},{"$f":"IF(AW101=\"\",\"\",IF(SUMIF(tbl_OPAOINN_P2Coi[Coinsurance],\">=\"&AU101,tbl_OPAOINN_P2Coi[Portion])>0.5,AU101,\"\"))","v":""},{"$f":"IF(COUNTIF(tbl_OPAOINN_P2Coi[Coinsurance],tbl_OPAOINN_P2Coi[[#This Row],[Coinsurance]])>1,\"Remove Duplicate Entry.\",IF(AND(tbl_OPAOINN_P2Coi[[#This Row],[Coinsurance]]<>\"\",tbl_OPAOINN_P2Coi[[#This Row],[Allowed Claims]]=0),\"Entry not found in Part 1 Table\",IF(AND(OFFSET(tbl_OPAOINN_P2Coi[[#This Row],[Coinsurance]],1,0)<>\"Total\",OFFSET(tbl_OPAOINN_P2Coi[[#This Row],[Coinsurance]],1,0)<>\"\",OFFSET(tbl_OPAOINN_P2Coi[[#This Row],[Coinsurance]],1,0)<tbl_OPAOINN_P2Coi[[#This Row],[Coinsurance]]),\"Sort Entries from lowest to highest\",\"\")))","v":""},null,null,null,null,null,{"$f":"SUMIF(tbl_OPOON_P1[Coinsurance],BD101,tbl_OPOON_P1[Plan Projected Allowed Amount])","v":0},{"$f":"IF(OR(BE101=0,BE101=\"\"),\"\",BE101/tbl_OPOON_P2Coi[[#Totals],[Allowed Claims]])","v":""},{"$f":"IF(BF101=\"\",\"\",IF(SUMIF(tbl_OPOON_P2Coi[Coinsurance],\">=\"&BD101,tbl_OPOON_P2Coi[Portion])>0.5,BD101,\"\"))","v":""},{"$f":"IF(COUNTIF(tbl_OPOON_P2Coi[Coinsurance],tbl_OPOON_P2Coi[[#This Row],[Coinsurance]])>1,\"Remove Duplicate Entry.\",IF(AND(tbl_OPOON_P2Coi[[#This Row],[Coinsurance]]<>\"\",tbl_OPOON_P2Coi[[#This Row],[Allowed Claims]]=0),\"Entry not found in Part 1 Table\",IF(AND(OFFSET(tbl_OPOON_P2Coi[[#This Row],[Coinsurance]],1,0)<>\"Total\",OFFSET(tbl_OPOON_P2Coi[[#This Row],[Coinsurance]],1,0)<>\"\",OFFSET(tbl_OPOON_P2Coi[[#This Row],[Coinsurance]],1,0)<tbl_OPOON_P2Coi[[#This Row],[Coinsurance]]),\"Sort Entries from lowest to highest\",\"\")))","v":""},null,null,null,null,null,{"$f":"SUMIF(tbl_OPOVOON_P1[Coinsurance],BM101,tbl_OPOVOON_P1[Plan Projected Allowed Amount])","v":0},{"$f":"IF(OR(BN101=0,BN101=\"\"),\"\",BN101/tbl_OPOVOON_P2Coi[[#Totals],[Allowed Claims]])","v":""},{"$f":"IF(BO101=\"\",\"\",IF(SUMIF(tbl_OPOVOON_P2Coi[Coinsurance],\">=\"&BM101,tbl_OPOVOON_P2Coi[Portion])>0.5,BM101,\"\"))","v":""},{"$f":"IF(COUNTIF(tbl_OPOVOON_P2Coi[Coinsurance],tbl_OPOVOON_P2Coi[[#This Row],[Coinsurance]])>1,\"Remove Duplicate Entry.\",IF(AND(tbl_OPOVOON_P2Coi[[#This Row],[Coinsurance]]<>\"\",tbl_OPOVOON_P2Coi[[#This Row],[Allowed Claims]]=0),\"Entry not found in Part 1 Table\",IF(AND(OFFSET(tbl_OPOVOON_P2Coi[[#This Row],[Coinsurance]],1,0)<>\"Total\",OFFSET(tbl_OPOVOON_P2Coi[[#This Row],[Coinsurance]],1,0)<>\"\",OFFSET(tbl_OPOVOON_P2Coi[[#This Row],[Coinsurance]],1,0)<tbl_OPOVOON_P2Coi[[#This Row],[Coinsurance]]),\"Sort Entries from lowest to highest\",\"\")))","v":""},null,null,null,null,null,{"$f":"SUMIF(tbl_OPAOOON_P1[Coinsurance],BV101,tbl_OPAOOON_P1[Plan Projected Allowed Amount])","v":0},{"$f":"IF(OR(BW101=0,BW101=\"\"),\"\",BW101/tbl_OPAOOON_P2Coi[[#Totals],[Allowed Claims]])","v":""},{"$f":"IF(BX101=\"\",\"\",IF(SUMIF(tbl_OPAOOON_P2Coi[Coinsurance],\">=\"&BV101,tbl_OPAOOON_P2Coi[Portion])>0.5,BV101,\"\"))","v":""},{"$f":"IF(COUNTIF(tbl_OPAOOON_P2Coi[Coinsurance],tbl_OPAOOON_P2Coi[[#This Row],[Coinsurance]])>1,\"Remove Duplicate Entry.\",IF(AND(tbl_OPAOOON_P2Coi[[#This Row],[Coinsurance]]<>\"\",tbl_OPAOOON_P2Coi[[#This Row],[Allowed Claims]]=0),\"Entry not found in Part 1 Table\",IF(AND(OFFSET(tbl_OPAOOON_P2Coi[[#This Row],[Coinsurance]],1,0)<>\"Total\",OFFSET(tbl_OPAOOON_P2Coi[[#This Row],[Coinsurance]],1,0)<>\"\",OFFSET(tbl_OPAOOON_P2Coi[[#This Row],[Coinsurance]],1,0)<tbl_OPAOOON_P2Coi[[#This Row],[Coinsurance]]),\"Sort Entries from lowest to highest\",\"\")))","v":""},null,null,null,null,null,{"$f":"SUMIF(tbl_ER_P1[Coinsurance],CE101,tbl_ER_P1[Plan Projected Allowed Amount])","v":0},{"$f":"IF(OR(CF101=0,CF101=\"\"),\"\",CF101/tbl_ER_P2Coi[[#Totals],[Allowed Claims]])","v":""},{"$f":"IF(CG101=\"\",\"\",IF(SUMIF(tbl_ER_P2Coi[Coinsurance],\">=\"&CE101,tbl_ER_P2Coi[Portion])>0.5,CE101,\"\"))","v":""},{"$f":"IF(COUNTIF(tbl_ER_P2Coi[Coinsurance],tbl_ER_P2Coi[[#This Row],[Coinsurance]])>1,\"Remove Duplicate Entry.\",IF(AND(tbl_ER_P2Coi[[#This Row],[Coinsurance]]<>\"\",tbl_ER_P2Coi[[#This Row],[Allowed Claims]]=0),\"Entry not found in Part 1 Table\",IF(AND(OFFSET(tbl_ER_P2Coi[[#This Row],[Coinsurance]],1,0)<>\"Total\",OFFSET(tbl_ER_P2Coi[[#This Row],[Coinsurance]],1,0)<>\"\",OFFSET(tbl_ER_P2Coi[[#This Row],[Coinsurance]],1,0)<tbl_ER_P2Coi[[#This Row],[Coinsurance]]),\"Sort Entries from lowest to highest\",\"\")))","v":""},null,null,null,null,null,{"$f":"SUMIF(tbl_RX_P1[Coinsurance],CN101,tbl_RX_P1[Plan Projected Allowed Amount])","v":0},{"$f":"IF(OR(CO101=0,CO101=\"\"),\"\",CO101/tbl_RX_P2Coi[[#Totals],[Allowed Claims]])","v":""},{"$f":"IF(CP101=\"\",\"\",IF(SUMIF(tbl_RX_P2Coi[Coinsurance],\">=\"&CN101,tbl_RX_P2Coi[Portion])>0.5,CN101,\"\"))","v":""},{"$f":"IF(COUNTIF(tbl_RX_P2Coi[Coinsurance],tbl_RX_P2Coi[[#This Row],[Coinsurance]])>1,\"Remove Duplicate Entry.\",IF(AND(tbl_RX_P2Coi[[#This Row],[Coinsurance]]<>\"\",tbl_RX_P2Coi[[#This Row],[Allowed Claims]]=0),\"Entry not found in Part 1 Table\",IF(AND(OFFSET(tbl_RX_P2Coi[[#This Row],[Coinsurance]],1,0)<>\"Total\",OFFSET(tbl_RX_P2Coi[[#This Row],[Coinsurance]],1,0)<>\"\",OFFSET(tbl_RX_P2Coi[[#This Row],[Coinsurance]],1,0)<tbl_RX_P2Coi[[#This Row],[Coinsurance]]),\"Sort Entries from lowest to highest\",\"\")))","v":""}]
[null,null,null,null,null,null,null,null,null,null,null,{"$f":"SUMIF(tbl_IPINN_P1[Coinsurance],K102,tbl_IPINN_P1[Plan Projected Allowed Amount])","v":0},{"$f":"IF(OR(L102=0,L102=\"\"),\"\",L102/tbl_IPINN_P2Coi[[#Totals],[Allowed Claims]])","v":""},{"$f":"IF(M102=\"\",\"\",IF(SUMIF(tbl_IPINN_P2Coi[Coinsurance],\">=\"&K102,tbl_IPINN_P2Coi[Portion])>0.5,K102,\"\"))","v":""},{"$f":"IF(COUNTIF(tbl_IPINN_P2Coi[Coinsurance],tbl_IPINN_P2Coi[[#This Row],[Coinsurance]])>1,\"Remove Duplicate Entry.\",IF(AND(tbl_IPINN_P2Coi[[#This Row],[Coinsurance]]<>\"\",tbl_IPINN_P2Coi[[#This Row],[Allowed Claims]]=0),\"Entry not found in Part 1 Table\",IF(AND(OFFSET(tbl_IPINN_P2Coi[[#This Row],[Coinsurance]],1,0)<>\"Total\",OFFSET(tbl_IPINN_P2Coi[[#This Row],[Coinsurance]],1,0)<>\"\",OFFSET(tbl_IPINN_P2Coi[[#This Row],[Coinsurance]],1,0)<tbl_IPINN_P2Coi[[#This Row],[Coinsurance]]),\"Sort Entries from lowest to highest\",\"\")))","v":""},null,null,null,null,null,{"$f":"SUMIF(tbl_IPOON_P1[Coinsurance],T102,tbl_IPOON_P1[Plan Projected Allowed Amount])","v":0},{"$f":"IF(OR(U102=0,U102=\"\"),\"\",U102/tbl_IPOON_P2Coi[[#Totals],[Allowed Claims]])","v":""},{"$f":"IF(V102=\"\",\"\",IF(SUMIF(tbl_IPOON_P2Coi[Coinsurance],\">=\"&T102,tbl_IPOON_P2Coi[Portion])>0.5,T102,\"\"))","v":""},{"$f":"IF(COUNTIF(tbl_IPOON_P2Coi[Coinsurance],tbl_IPOON_P2Coi[[#This Row],[Coinsurance]])>1,\"Remove Duplicate Entry.\",IF(AND(tbl_IPOON_P2Coi[[#This Row],[Coinsurance]]<>\"\",tbl_IPOON_P2Coi[[#This Row],[Allowed Claims]]=0),\"Entry not found in Part 1 Table\",IF(AND(OFFSET(tbl_IPOON_P2Coi[[#This Row],[Coinsurance]],1,0)<>\"Total\",OFFSET(tbl_IPOON_P2Coi[[#This Row],[Coinsurance]],1,0)<>\"\",OFFSET(tbl_IPOON_P2Coi[[#This Row],[Coinsurance]],1,0)<tbl_IPOON_P2Coi[[#This Row],[Coinsurance]]),\"Sort Entries from lowest to highest\",\"\")))","v":""},null,null,null,null,null,{"$f":"SUMIF(tbl_OPINN_P1[Coinsurance],AC102,tbl_OPINN_P1[Plan Projected Allowed Amount])","v":0},{"$f":"IF(OR(AD102=0,AD102=\"\"),\"\",AD102/tbl_OPINN_P2Coi[[#Totals],[Allowed Claims]])","v":""},{"$f":"IF(AE102=\"\",\"\",IF(SUMIF(tbl_OPINN_P2Coi[Coinsurance],\">=\"&AC102,tbl_OPINN_P2Coi[Portion])>0.5,AC102,\"\"))","v":""},{"$f":"IF(COUNTIF(tbl_OPINN_P2Coi[Coinsurance],tbl_OPINN_P2Coi[[#This Row],[Coinsurance]])>1,\"Remove Duplicate Entry.\",IF(AND(tbl_OPINN_P2Coi[[#This Row],[Coinsurance]]<>\"\",tbl_OPINN_P2Coi[[#This Row],[Allowed Claims]]=0),\"Entry not found in Part 1 Table\",IF(AND(OFFSET(tbl_OPINN_P2Coi[[#This Row],[Coinsurance]],1,0)<>\"Total\",OFFSET(tbl_OPINN_P2Coi[[#This Row],[Coinsurance]],1,0)<>\"\",OFFSET(tbl_OPINN_P2Coi[[#This Row],[Coinsurance]],1,0)<tbl_OPINN_P2Coi[[#This Row],[Coinsurance]]),\"Sort Entries from lowest to highest\",\"\")))","v":""},null,null,null,null,null,{"$f":"SUMIF(tbl_OPOVINN_P1[Coinsurance],AL102,tbl_OPOVINN_P1[Plan Projected Allowed Amount])","v":0},{"$f":"IF(OR(AM102=0,AM102=\"\"),\"\",AM102/tbl_OPOVINN_P2Coi[[#Totals],[Allowed Claims]])","v":""},{"$f":"IF(AN102=\"\",\"\",IF(SUMIF(tbl_OPOVINN_P2Coi[Coinsurance],\">=\"&AL102,tbl_OPOVINN_P2Coi[Portion])>0.5,AL102,\"\"))","v":""},{"$f":"IF(COUNTIF(tbl_OPOVINN_P2Coi[Coinsurance],tbl_OPOVINN_P2Coi[[#This Row],[Coinsurance]])>1,\"Remove Duplicate Entry.\",IF(AND(tbl_OPOVINN_P2Coi[[#This Row],[Coinsurance]]<>\"\",tbl_OPOVINN_P2Coi[[#This Row],[Allowed Claims]]=0),\"Entry not found in Part 1 Table\",IF(AND(OFFSET(tbl_OPOVINN_P2Coi[[#This Row],[Coinsurance]],1,0)<>\"Total\",OFFSET(tbl_OPOVINN_P2Coi[[#This Row],[Coinsurance]],1,0)<>\"\",OFFSET(tbl_OPOVINN_P2Coi[[#This Row],[Coinsurance]],1,0)<tbl_OPOVINN_P2Coi[[#This Row],[Coinsurance]]),\"Sort Entries from lowest to highest\",\"\")))","v":""},null,null,null,null,null,{"$f":"SUMIF(tbl_OPAOINN_P1[Coinsurance],AU102,tbl_OPAOINN_P1[Plan Projected Allowed Amount])","v":0},{"$f":"IF(OR(AV102=0,AV102=\"\"),\"\",AV102/tbl_OPAOINN_P2Coi[[#Totals],[Allowed Claims]])","v":""},{"$f":"IF(AW102=\"\",\"\",IF(SUMIF(tbl_OPAOINN_P2Coi[Coinsurance],\">=\"&AU102,tbl_OPAOINN_P2Coi[Portion])>0.5,AU102,\"\"))","v":""},{"$f":"IF(COUNTIF(tbl_OPAOINN_P2Coi[Coinsurance],tbl_OPAOINN_P2Coi[[#This Row],[Coinsurance]])>1,\"Remove Duplicate Entry.\",IF(AND(tbl_OPAOINN_P2Coi[[#This Row],[Coinsurance]]<>\"\",tbl_OPAOINN_P2Coi[[#This Row],[Allowed Claims]]=0),\"Entry not found in Part 1 Table\",IF(AND(OFFSET(tbl_OPAOINN_P2Coi[[#This Row],[Coinsurance]],1,0)<>\"Total\",OFFSET(tbl_OPAOINN_P2Coi[[#This Row],[Coinsurance]],1,0)<>\"\",OFFSET(tbl_OPAOINN_P2Coi[[#This Row],[Coinsurance]],1,0)<tbl_OPAOINN_P2Coi[[#This Row],[Coinsurance]]),\"Sort Entries from lowest to highest\",\"\")))","v":""},null,null,null,null,null,{"$f":"SUMIF(tbl_OPOON_P1[Coinsurance],BD102,tbl_OPOON_P1[Plan Projected Allowed Amount])","v":0},{"$f":"IF(OR(BE102=0,BE102=\"\"),\"\",BE102/tbl_OPOON_P2Coi[[#Totals],[Allowed Claims]])","v":""},{"$f":"IF(BF102=\"\",\"\",IF(SUMIF(tbl_OPOON_P2Coi[Coinsurance],\">=\"&BD102,tbl_OPOON_P2Coi[Portion])>0.5,BD102,\"\"))","v":""},{"$f":"IF(COUNTIF(tbl_OPOON_P2Coi[Coinsurance],tbl_OPOON_P2Coi[[#This Row],[Coinsurance]])>1,\"Remove Duplicate Entry.\",IF(AND(tbl_OPOON_P2Coi[[#This Row],[Coinsurance]]<>\"\",tbl_OPOON_P2Coi[[#This Row],[Allowed Claims]]=0),\"Entry not found in Part 1 Table\",IF(AND(OFFSET(tbl_OPOON_P2Coi[[#This Row],[Coinsurance]],1,0)<>\"Total\",OFFSET(tbl_OPOON_P2Coi[[#This Row],[Coinsurance]],1,0)<>\"\",OFFSET(tbl_OPOON_P2Coi[[#This Row],[Coinsurance]],1,0)<tbl_OPOON_P2Coi[[#This Row],[Coinsurance]]),\"Sort Entries from lowest to highest\",\"\")))","v":""},null,null,null,null,null,{"$f":"SUMIF(tbl_OPOVOON_P1[Coinsurance],BM102,tbl_OPOVOON_P1[Plan Projected Allowed Amount])","v":0},{"$f":"IF(OR(BN102=0,BN102=\"\"),\"\",BN102/tbl_OPOVOON_P2Coi[[#Totals],[Allowed Claims]])","v":""},{"$f":"IF(BO102=\"\",\"\",IF(SUMIF(tbl_OPOVOON_P2Coi[Coinsurance],\">=\"&BM102,tbl_OPOVOON_P2Coi[Portion])>0.5,BM102,\"\"))","v":""},{"$f":"IF(COUNTIF(tbl_OPOVOON_P2Coi[Coinsurance],tbl_OPOVOON_P2Coi[[#This Row],[Coinsurance]])>1,\"Remove Duplicate Entry.\",IF(AND(tbl_OPOVOON_P2Coi[[#This Row],[Coinsurance]]<>\"\",tbl_OPOVOON_P2Coi[[#This Row],[Allowed Claims]]=0),\"Entry not found in Part 1 Table\",IF(AND(OFFSET(tbl_OPOVOON_P2Coi[[#This Row],[Coinsurance]],1,0)<>\"Total\",OFFSET(tbl_OPOVOON_P2Coi[[#This Row],[Coinsurance]],1,0)<>\"\",OFFSET(tbl_OPOVOON_P2Coi[[#This Row],[Coinsurance]],1,0)<tbl_OPOVOON_P2Coi[[#This Row],[Coinsurance]]),\"Sort Entries from lowest to highest\",\"\")))","v":""},null,null,null,null,null,{"$f":"SUMIF(tbl_OPAOOON_P1[Coinsurance],BV102,tbl_OPAOOON_P1[Plan Projected Allowed Amount])","v":0},{"$f":"IF(OR(BW102=0,BW102=\"\"),\"\",BW102/tbl_OPAOOON_P2Coi[[#Totals],[Allowed Claims]])","v":""},{"$f":"IF(BX102=\"\",\"\",IF(SUMIF(tbl_OPAOOON_P2Coi[Coinsurance],\">=\"&BV102,tbl_OPAOOON_P2Coi[Portion])>0.5,BV102,\"\"))","v":""},{"$f":"IF(COUNTIF(tbl_OPAOOON_P2Coi[Coinsurance],tbl_OPAOOON_P2Coi[[#This Row],[Coinsurance]])>1,\"Remove Duplicate Entry.\",IF(AND(tbl_OPAOOON_P2Coi[[#This Row],[Coinsurance]]<>\"\",tbl_OPAOOON_P2Coi[[#This Row],[Allowed Claims]]=0),\"Entry not found in Part 1 Table\",IF(AND(OFFSET(tbl_OPAOOON_P2Coi[[#This Row],[Coinsurance]],1,0)<>\"Total\",OFFSET(tbl_OPAOOON_P2Coi[[#This Row],[Coinsurance]],1,0)<>\"\",OFFSET(tbl_OPAOOON_P2Coi[[#This Row],[Coinsurance]],1,0)<tbl_OPAOOON_P2Coi[[#This Row],[Coinsurance]]),\"Sort Entries from lowest to highest\",\"\")))","v":""},null,null,null,null,null,{"$f":"SUMIF(tbl_ER_P1[Coinsurance],CE102,tbl_ER_P1[Plan Projected Allowed Amount])","v":0},{"$f":"IF(OR(CF102=0,CF102=\"\"),\"\",CF102/tbl_ER_P2Coi[[#Totals],[Allowed Claims]])","v":""},{"$f":"IF(CG102=\"\",\"\",IF(SUMIF(tbl_ER_P2Coi[Coinsurance],\">=\"&CE102,tbl_ER_P2Coi[Portion])>0.5,CE102,\"\"))","v":""},{"$f":"IF(COUNTIF(tbl_ER_P2Coi[Coinsurance],tbl_ER_P2Coi[[#This Row],[Coinsurance]])>1,\"Remove Duplicate Entry.\",IF(AND(tbl_ER_P2Coi[[#This Row],[Coinsurance]]<>\"\",tbl_ER_P2Coi[[#This Row],[Allowed Claims]]=0),\"Entry not found in Part 1 Table\",IF(AND(OFFSET(tbl_ER_P2Coi[[#This Row],[Coinsurance]],1,0)<>\"Total\",OFFSET(tbl_ER_P2Coi[[#This Row],[Coinsurance]],1,0)<>\"\",OFFSET(tbl_ER_P2Coi[[#This Row],[Coinsurance]],1,0)<tbl_ER_P2Coi[[#This Row],[Coinsurance]]),\"Sort Entries from lowest to highest\",\"\")))","v":""},null,null,null,null,null,{"$f":"SUMIF(tbl_RX_P1[Coinsurance],CN102,tbl_RX_P1[Plan Projected Allowed Amount])","v":0},{"$f":"IF(OR(CO102=0,CO102=\"\"),\"\",CO102/tbl_RX_P2Coi[[#Totals],[Allowed Claims]])","v":""},{"$f":"IF(CP102=\"\",\"\",IF(SUMIF(tbl_RX_P2Coi[Coinsurance],\">=\"&CN102,tbl_RX_P2Coi[Portion])>0.5,CN102,\"\"))","v":""},{"$f":"IF(COUNTIF(tbl_RX_P2Coi[Coinsurance],tbl_RX_P2Coi[[#This Row],[Coinsurance]])>1,\"Remove Duplicate Entry.\",IF(AND(tbl_RX_P2Coi[[#This Row],[Coinsurance]]<>\"\",tbl_RX_P2Coi[[#This Row],[Allowed Claims]]=0),\"Entry not found in Part 1 Table\",IF(AND(OFFSET(tbl_RX_P2Coi[[#This Row],[Coinsurance]],1,0)<>\"Total\",OFFSET(tbl_RX_P2Coi[[#This Row],[Coinsurance]],1,0)<>\"\",OFFSET(tbl_RX_P2Coi[[#This Row],[Coinsurance]],1,0)<tbl_RX_P2Coi[[#This Row],[Coinsurance]]),\"Sort Entries from lowest to highest\",\"\")))","v":""}]
[null,null,null,null,null,null,null,null,null,null,null,{"$f":"SUMIF(tbl_IPINN_P1[Coinsurance],K103,tbl_IPINN_P1[Plan Projected Allowed Amount])","v":0},{"$f":"IF(OR(L103=0,L103=\"\"),\"\",L103/tbl_IPINN_P2Coi[[#Totals],[Allowed Claims]])","v":""},{"$f":"IF(M103=\"\",\"\",IF(SUMIF(tbl_IPINN_P2Coi[Coinsurance],\">=\"&K103,tbl_IPINN_P2Coi[Portion])>0.5,K103,\"\"))","v":""},{"$f":"IF(COUNTIF(tbl_IPINN_P2Coi[Coinsurance],tbl_IPINN_P2Coi[[#This Row],[Coinsurance]])>1,\"Remove Duplicate Entry.\",IF(AND(tbl_IPINN_P2Coi[[#This Row],[Coinsurance]]<>\"\",tbl_IPINN_P2Coi[[#This Row],[Allowed Claims]]=0),\"Entry not found in Part 1 Table\",IF(AND(OFFSET(tbl_IPINN_P2Coi[[#This Row],[Coinsurance]],1,0)<>\"Total\",OFFSET(tbl_IPINN_P2Coi[[#This Row],[Coinsurance]],1,0)<>\"\",OFFSET(tbl_IPINN_P2Coi[[#This Row],[Coinsurance]],1,0)<tbl_IPINN_P2Coi[[#This Row],[Coinsurance]]),\"Sort Entries from lowest to highest\",\"\")))","v":""},null,null,null,null,null,{"$f":"SUMIF(tbl_IPOON_P1[Coinsurance],T103,tbl_IPOON_P1[Plan Projected Allowed Amount])","v":0},{"$f":"IF(OR(U103=0,U103=\"\"),\"\",U103/tbl_IPOON_P2Coi[[#Totals],[Allowed Claims]])","v":""},{"$f":"IF(V103=\"\",\"\",IF(SUMIF(tbl_IPOON_P2Coi[Coinsurance],\">=\"&T103,tbl_IPOON_P2Coi[Portion])>0.5,T103,\"\"))","v":""},{"$f":"IF(COUNTIF(tbl_IPOON_P2Coi[Coinsurance],tbl_IPOON_P2Coi[[#This Row],[Coinsurance]])>1,\"Remove Duplicate Entry.\",IF(AND(tbl_IPOON_P2Coi[[#This Row],[Coinsurance]]<>\"\",tbl_IPOON_P2Coi[[#This Row],[Allowed Claims]]=0),\"Entry not found in Part 1 Table\",IF(AND(OFFSET(tbl_IPOON_P2Coi[[#This Row],[Coinsurance]],1,0)<>\"Total\",OFFSET(tbl_IPOON_P2Coi[[#This Row],[Coinsurance]],1,0)<>\"\",OFFSET(tbl_IPOON_P2Coi[[#This Row],[Coinsurance]],1,0)<tbl_IPOON_P2Coi[[#This Row],[Coinsurance]]),\"Sort Entries from lowest to highest\",\"\")))","v":""},null,null,null,null,null,{"$f":"SUMIF(tbl_OPINN_P1[Coinsurance],AC103,tbl_OPINN_P1[Plan Projected Allowed Amount])","v":0},{"$f":"IF(OR(AD103=0,AD103=\"\"),\"\",AD103/tbl_OPINN_P2Coi[[#Totals],[Allowed Claims]])","v":""},{"$f":"IF(AE103=\"\",\"\",IF(SUMIF(tbl_OPINN_P2Coi[Coinsurance],\">=\"&AC103,tbl_OPINN_P2Coi[Portion])>0.5,AC103,\"\"))","v":""},{"$f":"IF(COUNTIF(tbl_OPINN_P2Coi[Coinsurance],tbl_OPINN_P2Coi[[#This Row],[Coinsurance]])>1,\"Remove Duplicate Entry.\",IF(AND(tbl_OPINN_P2Coi[[#This Row],[Coinsurance]]<>\"\",tbl_OPINN_P2Coi[[#This Row],[Allowed Claims]]=0),\"Entry not found in Part 1 Table\",IF(AND(OFFSET(tbl_OPINN_P2Coi[[#This Row],[Coinsurance]],1,0)<>\"Total\",OFFSET(tbl_OPINN_P2Coi[[#This Row],[Coinsurance]],1,0)<>\"\",OFFSET(tbl_OPINN_P2Coi[[#This Row],[Coinsurance]],1,0)<tbl_OPINN_P2Coi[[#This Row],[Coinsurance]]),\"Sort Entries from lowest to highest\",\"\")))","v":""},null,null,null,null,null,{"$f":"SUMIF(tbl_OPOVINN_P1[Coinsurance],AL103,tbl_OPOVINN_P1[Plan Projected Allowed Amount])","v":0},{"$f":"IF(OR(AM103=0,AM103=\"\"),\"\",AM103/tbl_OPOVINN_P2Coi[[#Totals],[Allowed Claims]])","v":""},{"$f":"IF(AN103=\"\",\"\",IF(SUMIF(tbl_OPOVINN_P2Coi[Coinsurance],\">=\"&AL103,tbl_OPOVINN_P2Coi[Portion])>0.5,AL103,\"\"))","v":""},{"$f":"IF(COUNTIF(tbl_OPOVINN_P2Coi[Coinsurance],tbl_OPOVINN_P2Coi[[#This Row],[Coinsurance]])>1,\"Remove Duplicate Entry.\",IF(AND(tbl_OPOVINN_P2Coi[[#This Row],[Coinsurance]]<>\"\",tbl_OPOVINN_P2Coi[[#This Row],[Allowed Claims]]=0),\"Entry not found in Part 1 Table\",IF(AND(OFFSET(tbl_OPOVINN_P2Coi[[#This Row],[Coinsurance]],1,0)<>\"Total\",OFFSET(tbl_OPOVINN_P2Coi[[#This Row],[Coinsurance]],1,0)<>\"\",OFFSET(tbl_OPOVINN_P2Coi[[#This Row],[Coinsurance]],1,0)<tbl_OPOVINN_P2Coi[[#This Row],[Coinsurance]]),\"Sort Entries from lowest to highest\",\"\")))","v":""},null,null,null,null,null,{"$f":"SUMIF(tbl_OPAOINN_P1[Coinsurance],AU103,tbl_OPAOINN_P1[Plan Projected Allowed Amount])","v":0},{"$f":"IF(OR(AV103=0,AV103=\"\"),\"\",AV103/tbl_OPAOINN_P2Coi[[#Totals],[Allowed Claims]])","v":""},{"$f":"IF(AW103=\"\",\"\",IF(SUMIF(tbl_OPAOINN_P2Coi[Coinsurance],\">=\"&AU103,tbl_OPAOINN_P2Coi[Portion])>0.5,AU103,\"\"))","v":""},{"$f":"IF(COUNTIF(tbl_OPAOINN_P2Coi[Coinsurance],tbl_OPAOINN_P2Coi[[#This Row],[Coinsurance]])>1,\"Remove Duplicate Entry.\",IF(AND(tbl_OPAOINN_P2Coi[[#This Row],[Coinsurance]]<>\"\",tbl_OPAOINN_P2Coi[[#This Row],[Allowed Claims]]=0),\"Entry not found in Part 1 Table\",IF(AND(OFFSET(tbl_OPAOINN_P2Coi[[#This Row],[Coinsurance]],1,0)<>\"Total\",OFFSET(tbl_OPAOINN_P2Coi[[#This Row],[Coinsurance]],1,0)<>\"\",OFFSET(tbl_OPAOINN_P2Coi[[#This Row],[Coinsurance]],1,0)<tbl_OPAOINN_P2Coi[[#This Row],[Coinsurance]]),\"Sort Entries from lowest to highest\",\"\")))","v":""},null,null,null,null,null,{"$f":"SUMIF(tbl_OPOON_P1[Coinsurance],BD103,tbl_OPOON_P1[Plan Projected Allowed Amount])","v":0},{"$f":"IF(OR(BE103=0,BE103=\"\"),\"\",BE103/tbl_OPOON_P2Coi[[#Totals],[Allowed Claims]])","v":""},{"$f":"IF(BF103=\"\",\"\",IF(SUMIF(tbl_OPOON_P2Coi[Coinsurance],\">=\"&BD103,tbl_OPOON_P2Coi[Portion])>0.5,BD103,\"\"))","v":""},{"$f":"IF(COUNTIF(tbl_OPOON_P2Coi[Coinsurance],tbl_OPOON_P2Coi[[#This Row],[Coinsurance]])>1,\"Remove Duplicate Entry.\",IF(AND(tbl_OPOON_P2Coi[[#This Row],[Coinsurance]]<>\"\",tbl_OPOON_P2Coi[[#This Row],[Allowed Claims]]=0),\"Entry not found in Part 1 Table\",IF(AND(OFFSET(tbl_OPOON_P2Coi[[#This Row],[Coinsurance]],1,0)<>\"Total\",OFFSET(tbl_OPOON_P2Coi[[#This Row],[Coinsurance]],1,0)<>\"\",OFFSET(tbl_OPOON_P2Coi[[#This Row],[Coinsurance]],1,0)<tbl_OPOON_P2Coi[[#This Row],[Coinsurance]]),\"Sort Entries from lowest to highest\",\"\")))","v":""},null,null,null,null,null,{"$f":"SUMIF(tbl_OPOVOON_P1[Coinsurance],BM103,tbl_OPOVOON_P1[Plan Projected Allowed Amount])","v":0},{"$f":"IF(OR(BN103=0,BN103=\"\"),\"\",BN103/tbl_OPOVOON_P2Coi[[#Totals],[Allowed Claims]])","v":""},{"$f":"IF(BO103=\"\",\"\",IF(SUMIF(tbl_OPOVOON_P2Coi[Coinsurance],\">=\"&BM103,tbl_OPOVOON_P2Coi[Portion])>0.5,BM103,\"\"))","v":""},{"$f":"IF(COUNTIF(tbl_OPOVOON_P2Coi[Coinsurance],tbl_OPOVOON_P2Coi[[#This Row],[Coinsurance]])>1,\"Remove Duplicate Entry.\",IF(AND(tbl_OPOVOON_P2Coi[[#This Row],[Coinsurance]]<>\"\",tbl_OPOVOON_P2Coi[[#This Row],[Allowed Claims]]=0),\"Entry not found in Part 1 Table\",IF(AND(OFFSET(tbl_OPOVOON_P2Coi[[#This Row],[Coinsurance]],1,0)<>\"Total\",OFFSET(tbl_OPOVOON_P2Coi[[#This Row],[Coinsurance]],1,0)<>\"\",OFFSET(tbl_OPOVOON_P2Coi[[#This Row],[Coinsurance]],1,0)<tbl_OPOVOON_P2Coi[[#This Row],[Coinsurance]]),\"Sort Entries from lowest to highest\",\"\")))","v":""},null,null,null,null,null,{"$f":"SUMIF(tbl_OPAOOON_P1[Coinsurance],BV103,tbl_OPAOOON_P1[Plan Projected Allowed Amount])","v":0},{"$f":"IF(OR(BW103=0,BW103=\"\"),\"\",BW103/tbl_OPAOOON_P2Coi[[#Totals],[Allowed Claims]])","v":""},{"$f":"IF(BX103=\"\",\"\",IF(SUMIF(tbl_OPAOOON_P2Coi[Coinsurance],\">=\"&BV103,tbl_OPAOOON_P2Coi[Portion])>0.5,BV103,\"\"))","v":""},{"$f":"IF(COUNTIF(tbl_OPAOOON_P2Coi[Coinsurance],tbl_OPAOOON_P2Coi[[#This Row],[Coinsurance]])>1,\"Remove Duplicate Entry.\",IF(AND(tbl_OPAOOON_P2Coi[[#This Row],[Coinsurance]]<>\"\",tbl_OPAOOON_P2Coi[[#This Row],[Allowed Claims]]=0),\"Entry not found in Part 1 Table\",IF(AND(OFFSET(tbl_OPAOOON_P2Coi[[#This Row],[Coinsurance]],1,0)<>\"Total\",OFFSET(tbl_OPAOOON_P2Coi[[#This Row],[Coinsurance]],1,0)<>\"\",OFFSET(tbl_OPAOOON_P2Coi[[#This Row],[Coinsurance]],1,0)<tbl_OPAOOON_P2Coi[[#This Row],[Coinsurance]]),\"Sort Entries from lowest to highest\",\"\")))","v":""},null,null,null,null,null,{"$f":"SUMIF(tbl_ER_P1[Coinsurance],CE103,tbl_ER_P1[Plan Projected Allowed Amount])","v":0},{"$f":"IF(OR(CF103=0,CF103=\"\"),\"\",CF103/tbl_ER_P2Coi[[#Totals],[Allowed Claims]])","v":""},{"$f":"IF(CG103=\"\",\"\",IF(SUMIF(tbl_ER_P2Coi[Coinsurance],\">=\"&CE103,tbl_ER_P2Coi[Portion])>0.5,CE103,\"\"))","v":""},{"$f":"IF(COUNTIF(tbl_ER_P2Coi[Coinsurance],tbl_ER_P2Coi[[#This Row],[Coinsurance]])>1,\"Remove Duplicate Entry.\",IF(AND(tbl_ER_P2Coi[[#This Row],[Coinsurance]]<>\"\",tbl_ER_P2Coi[[#This Row],[Allowed Claims]]=0),\"Entry not found in Part 1 Table\",IF(AND(OFFSET(tbl_ER_P2Coi[[#This Row],[Coinsurance]],1,0)<>\"Total\",OFFSET(tbl_ER_P2Coi[[#This Row],[Coinsurance]],1,0)<>\"\",OFFSET(tbl_ER_P2Coi[[#This Row],[Coinsurance]],1,0)<tbl_ER_P2Coi[[#This Row],[Coinsurance]]),\"Sort Entries from lowest to highest\",\"\")))","v":""},null,null,null,null,null,{"$f":"SUMIF(tbl_RX_P1[Coinsurance],CN103,tbl_RX_P1[Plan Projected Allowed Amount])","v":0},{"$f":"IF(OR(CO103=0,CO103=\"\"),\"\",CO103/tbl_RX_P2Coi[[#Totals],[Allowed Claims]])","v":""},{"$f":"IF(CP103=\"\",\"\",IF(SUMIF(tbl_RX_P2Coi[Coinsurance],\">=\"&CN103,tbl_RX_P2Coi[Portion])>0.5,CN103,\"\"))","v":""},{"$f":"IF(COUNTIF(tbl_RX_P2Coi[Coinsurance],tbl_RX_P2Coi[[#This Row],[Coinsurance]])>1,\"Remove Duplicate Entry.\",IF(AND(tbl_RX_P2Coi[[#This Row],[Coinsurance]]<>\"\",tbl_RX_P2Coi[[#This Row],[Allowed Claims]]=0),\"Entry not found in Part 1 Table\",IF(AND(OFFSET(tbl_RX_P2Coi[[#This Row],[Coinsurance]],1,0)<>\"Total\",OFFSET(tbl_RX_P2Coi[[#This Row],[Coinsurance]],1,0)<>\"\",OFFSET(tbl_RX_P2Coi[[#This Row],[Coinsurance]],1,0)<tbl_RX_P2Coi[[#This Row],[Coinsurance]]),\"Sort Entries from lowest to highest\",\"\")))","v":""}]
[null,null,null,null,null,null,null,null,null,null,null,{"$f":"SUMIF(tbl_IPINN_P1[Coinsurance],K104,tbl_IPINN_P1[Plan Projected Allowed Amount])","v":0},{"$f":"IF(OR(L104=0,L104=\"\"),\"\",L104/tbl_IPINN_P2Coi[[#Totals],[Allowed Claims]])","v":""},{"$f":"IF(M104=\"\",\"\",IF(SUMIF(tbl_IPINN_P2Coi[Coinsurance],\">=\"&K104,tbl_IPINN_P2Coi[Portion])>0.5,K104,\"\"))","v":""},{"$f":"IF(COUNTIF(tbl_IPINN_P2Coi[Coinsurance],tbl_IPINN_P2Coi[[#This Row],[Coinsurance]])>1,\"Remove Duplicate Entry.\",IF(AND(tbl_IPINN_P2Coi[[#This Row],[Coinsurance]]<>\"\",tbl_IPINN_P2Coi[[#This Row],[Allowed Claims]]=0),\"Entry not found in Part 1 Table\",IF(AND(OFFSET(tbl_IPINN_P2Coi[[#This Row],[Coinsurance]],1,0)<>\"Total\",OFFSET(tbl_IPINN_P2Coi[[#This Row],[Coinsurance]],1,0)<>\"\",OFFSET(tbl_IPINN_P2Coi[[#This Row],[Coinsurance]],1,0)<tbl_IPINN_P2Coi[[#This Row],[Coinsurance]]),\"Sort Entries from lowest to highest\",\"\")))","v":""},null,null,null,null,null,{"$f":"SUMIF(tbl_IPOON_P1[Coinsurance],T104,tbl_IPOON_P1[Plan Projected Allowed Amount])","v":0},{"$f":"IF(OR(U104=0,U104=\"\"),\"\",U104/tbl_IPOON_P2Coi[[#Totals],[Allowed Claims]])","v":""},{"$f":"IF(V104=\"\",\"\",IF(SUMIF(tbl_IPOON_P2Coi[Coinsurance],\">=\"&T104,tbl_IPOON_P2Coi[Portion])>0.5,T104,\"\"))","v":""},{"$f":"IF(COUNTIF(tbl_IPOON_P2Coi[Coinsurance],tbl_IPOON_P2Coi[[#This Row],[Coinsurance]])>1,\"Remove Duplicate Entry.\",IF(AND(tbl_IPOON_P2Coi[[#This Row],[Coinsurance]]<>\"\",tbl_IPOON_P2Coi[[#This Row],[Allowed Claims]]=0),\"Entry not found in Part 1 Table\",IF(AND(OFFSET(tbl_IPOON_P2Coi[[#This Row],[Coinsurance]],1,0)<>\"Total\",OFFSET(tbl_IPOON_P2Coi[[#This Row],[Coinsurance]],1,0)<>\"\",OFFSET(tbl_IPOON_P2Coi[[#This Row],[Coinsurance]],1,0)<tbl_IPOON_P2Coi[[#This Row],[Coinsurance]]),\"Sort Entries from lowest to highest\",\"\")))","v":""},null,null,null,null,null,{"$f":"SUMIF(tbl_OPINN_P1[Coinsurance],AC104,tbl_OPINN_P1[Plan Projected Allowed Amount])","v":0},{"$f":"IF(OR(AD104=0,AD104=\"\"),\"\",AD104/tbl_OPINN_P2Coi[[#Totals],[Allowed Claims]])","v":""},{"$f":"IF(AE104=\"\",\"\",IF(SUMIF(tbl_OPINN_P2Coi[Coinsurance],\">=\"&AC104,tbl_OPINN_P2Coi[Portion])>0.5,AC104,\"\"))","v":""},{"$f":"IF(COUNTIF(tbl_OPINN_P2Coi[Coinsurance],tbl_OPINN_P2Coi[[#This Row],[Coinsurance]])>1,\"Remove Duplicate Entry.\",IF(AND(tbl_OPINN_P2Coi[[#This Row],[Coinsurance]]<>\"\",tbl_OPINN_P2Coi[[#This Row],[Allowed Claims]]=0),\"Entry not found in Part 1 Table\",IF(AND(OFFSET(tbl_OPINN_P2Coi[[#This Row],[Coinsurance]],1,0)<>\"Total\",OFFSET(tbl_OPINN_P2Coi[[#This Row],[Coinsurance]],1,0)<>\"\",OFFSET(tbl_OPINN_P2Coi[[#This Row],[Coinsurance]],1,0)<tbl_OPINN_P2Coi[[#This Row],[Coinsurance]]),\"Sort Entries from lowest to highest\",\"\")))","v":""},null,null,null,null,null,{"$f":"SUMIF(tbl_OPOVINN_P1[Coinsurance],AL104,tbl_OPOVINN_P1[Plan Projected Allowed Amount])","v":0},{"$f":"IF(OR(AM104=0,AM104=\"\"),\"\",AM104/tbl_OPOVINN_P2Coi[[#Totals],[Allowed Claims]])","v":""},{"$f":"IF(AN104=\"\",\"\",IF(SUMIF(tbl_OPOVINN_P2Coi[Coinsurance],\">=\"&AL104,tbl_OPOVINN_P2Coi[Portion])>0.5,AL104,\"\"))","v":""},{"$f":"IF(COUNTIF(tbl_OPOVINN_P2Coi[Coinsurance],tbl_OPOVINN_P2Coi[[#This Row],[Coinsurance]])>1,\"Remove Duplicate Entry.\",IF(AND(tbl_OPOVINN_P2Coi[[#This Row],[Coinsurance]]<>\"\",tbl_OPOVINN_P2Coi[[#This Row],[Allowed Claims]]=0),\"Entry not found in Part 1 Table\",IF(AND(OFFSET(tbl_OPOVINN_P2Coi[[#This Row],[Coinsurance]],1,0)<>\"Total\",OFFSET(tbl_OPOVINN_P2Coi[[#This Row],[Coinsurance]],1,0)<>\"\",OFFSET(tbl_OPOVINN_P2Coi[[#This Row],[Coinsurance]],1,0)<tbl_OPOVINN_P2Coi[[#This Row],[Coinsurance]]),\"Sort Entries from lowest to highest\",\"\")))","v":""},null,null,null,null,null,{"$f":"SUMIF(tbl_OPAOINN_P1[Coinsurance],AU104,tbl_OPAOINN_P1[Plan Projected Allowed Amount])","v":0},{"$f":"IF(OR(AV104=0,AV104=\"\"),\"\",AV104/tbl_OPAOINN_P2Coi[[#Totals],[Allowed Claims]])","v":""},{"$f":"IF(AW104=\"\",\"\",IF(SUMIF(tbl_OPAOINN_P2Coi[Coinsurance],\">=\"&AU104,tbl_OPAOINN_P2Coi[Portion])>0.5,AU104,\"\"))","v":""},{"$f":"IF(COUNTIF(tbl_OPAOINN_P2Coi[Coinsurance],tbl_OPAOINN_P2Coi[[#This Row],[Coinsurance]])>1,\"Remove Duplicate Entry.\",IF(AND(tbl_OPAOINN_P2Coi[[#This Row],[Coinsurance]]<>\"\",tbl_OPAOINN_P2Coi[[#This Row],[Allowed Claims]]=0),\"Entry not found in Part 1 Table\",IF(AND(OFFSET(tbl_OPAOINN_P2Coi[[#This Row],[Coinsurance]],1,0)<>\"Total\",OFFSET(tbl_OPAOINN_P2Coi[[#This Row],[Coinsurance]],1,0)<>\"\",OFFSET(tbl_OPAOINN_P2Coi[[#This Row],[Coinsurance]],1,0)<tbl_OPAOINN_P2Coi[[#This Row],[Coinsurance]]),\"Sort Entries from lowest to highest\",\"\")))","v":""},null,null,null,null,null,{"$f":"SUMIF(tbl_OPOON_P1[Coinsurance],BD104,tbl_OPOON_P1[Plan Projected Allowed Amount])","v":0},{"$f":"IF(OR(BE104=0,BE104=\"\"),\"\",BE104/tbl_OPOON_P2Coi[[#Totals],[Allowed Claims]])","v":""},{"$f":"IF(BF104=\"\",\"\",IF(SUMIF(tbl_OPOON_P2Coi[Coinsurance],\">=\"&BD104,tbl_OPOON_P2Coi[Portion])>0.5,BD104,\"\"))","v":""},{"$f":"IF(COUNTIF(tbl_OPOON_P2Coi[Coinsurance],tbl_OPOON_P2Coi[[#This Row],[Coinsurance]])>1,\"Remove Duplicate Entry.\",IF(AND(tbl_OPOON_P2Coi[[#This Row],[Coinsurance]]<>\"\",tbl_OPOON_P2Coi[[#This Row],[Allowed Claims]]=0),\"Entry not found in Part 1 Table\",IF(AND(OFFSET(tbl_OPOON_P2Coi[[#This Row],[Coinsurance]],1,0)<>\"Total\",OFFSET(tbl_OPOON_P2Coi[[#This Row],[Coinsurance]],1,0)<>\"\",OFFSET(tbl_OPOON_P2Coi[[#This Row],[Coinsurance]],1,0)<tbl_OPOON_P2Coi[[#This Row],[Coinsurance]]),\"Sort Entries from lowest to highest\",\"\")))","v":""},null,null,null,null,null,{"$f":"SUMIF(tbl_OPOVOON_P1[Coinsurance],BM104,tbl_OPOVOON_P1[Plan Projected Allowed Amount])","v":0},{"$f":"IF(OR(BN104=0,BN104=\"\"),\"\",BN104/tbl_OPOVOON_P2Coi[[#Totals],[Allowed Claims]])","v":""},{"$f":"IF(BO104=\"\",\"\",IF(SUMIF(tbl_OPOVOON_P2Coi[Coinsurance],\">=\"&BM104,tbl_OPOVOON_P2Coi[Portion])>0.5,BM104,\"\"))","v":""},{"$f":"IF(COUNTIF(tbl_OPOVOON_P2Coi[Coinsurance],tbl_OPOVOON_P2Coi[[#This Row],[Coinsurance]])>1,\"Remove Duplicate Entry.\",IF(AND(tbl_OPOVOON_P2Coi[[#This Row],[Coinsurance]]<>\"\",tbl_OPOVOON_P2Coi[[#This Row],[Allowed Claims]]=0),\"Entry not found in Part 1 Table\",IF(AND(OFFSET(tbl_OPOVOON_P2Coi[[#This Row],[Coinsurance]],1,0)<>\"Total\",OFFSET(tbl_OPOVOON_P2Coi[[#This Row],[Coinsurance]],1,0)<>\"\",OFFSET(tbl_OPOVOON_P2Coi[[#This Row],[Coinsurance]],1,0)<tbl_OPOVOON_P2Coi[[#This Row],[Coinsurance]]),\"Sort Entries from lowest to highest\",\"\")))","v":""},null,null,null,null,null,{"$f":"SUMIF(tbl_OPAOOON_P1[Coinsurance],BV104,tbl_OPAOOON_P1[Plan Projected Allowed Amount])","v":0},{"$f":"IF(OR(BW104=0,BW104=\"\"),\"\",BW104/tbl_OPAOOON_P2Coi[[#Totals],[Allowed Claims]])","v":""},{"$f":"IF(BX104=\"\",\"\",IF(SUMIF(tbl_OPAOOON_P2Coi[Coinsurance],\">=\"&BV104,tbl_OPAOOON_P2Coi[Portion])>0.5,BV104,\"\"))","v":""},{"$f":"IF(COUNTIF(tbl_OPAOOON_P2Coi[Coinsurance],tbl_OPAOOON_P2Coi[[#This Row],[Coinsurance]])>1,\"Remove Duplicate Entry.\",IF(AND(tbl_OPAOOON_P2Coi[[#This Row],[Coinsurance]]<>\"\",tbl_OPAOOON_P2Coi[[#This Row],[Allowed Claims]]=0),\"Entry not found in Part 1 Table\",IF(AND(OFFSET(tbl_OPAOOON_P2Coi[[#This Row],[Coinsurance]],1,0)<>\"Total\",OFFSET(tbl_OPAOOON_P2Coi[[#This Row],[Coinsurance]],1,0)<>\"\",OFFSET(tbl_OPAOOON_P2Coi[[#This Row],[Coinsurance]],1,0)<tbl_OPAOOON_P2Coi[[#This Row],[Coinsurance]]),\"Sort Entries from lowest to highest\",\"\")))","v":""},null,null,null,null,null,{"$f":"SUMIF(tbl_ER_P1[Coinsurance],CE104,tbl_ER_P1[Plan Projected Allowed Amount])","v":0},{"$f":"IF(OR(CF104=0,CF104=\"\"),\"\",CF104/tbl_ER_P2Coi[[#Totals],[Allowed Claims]])","v":""},{"$f":"IF(CG104=\"\",\"\",IF(SUMIF(tbl_ER_P2Coi[Coinsurance],\">=\"&CE104,tbl_ER_P2Coi[Portion])>0.5,CE104,\"\"))","v":""},{"$f":"IF(COUNTIF(tbl_ER_P2Coi[Coinsurance],tbl_ER_P2Coi[[#This Row],[Coinsurance]])>1,\"Remove Duplicate Entry.\",IF(AND(tbl_ER_P2Coi[[#This Row],[Coinsurance]]<>\"\",tbl_ER_P2Coi[[#This Row],[Allowed Claims]]=0),\"Entry not found in Part 1 Table\",IF(AND(OFFSET(tbl_ER_P2Coi[[#This Row],[Coinsurance]],1,0)<>\"Total\",OFFSET(tbl_ER_P2Coi[[#This Row],[Coinsurance]],1,0)<>\"\",OFFSET(tbl_ER_P2Coi[[#This Row],[Coinsurance]],1,0)<tbl_ER_P2Coi[[#This Row],[Coinsurance]]),\"Sort Entries from lowest to highest\",\"\")))","v":""},null,null,null,null,null,{"$f":"SUMIF(tbl_RX_P1[Coinsurance],CN104,tbl_RX_P1[Plan Projected Allowed Amount])","v":0},{"$f":"IF(OR(CO104=0,CO104=\"\"),\"\",CO104/tbl_RX_P2Coi[[#Totals],[Allowed Claims]])","v":""},{"$f":"IF(CP104=\"\",\"\",IF(SUMIF(tbl_RX_P2Coi[Coinsurance],\">=\"&CN104,tbl_RX_P2Coi[Portion])>0.5,CN104,\"\"))","v":""},{"$f":"IF(COUNTIF(tbl_RX_P2Coi[Coinsurance],tbl_RX_P2Coi[[#This Row],[Coinsurance]])>1,\"Remove Duplicate Entry.\",IF(AND(tbl_RX_P2Coi[[#This Row],[Coinsurance]]<>\"\",tbl_RX_P2Coi[[#This Row],[Allowed Claims]]=0),\"Entry not found in Part 1 Table\",IF(AND(OFFSET(tbl_RX_P2Coi[[#This Row],[Coinsurance]],1,0)<>\"Total\",OFFSET(tbl_RX_P2Coi[[#This Row],[Coinsurance]],1,0)<>\"\",OFFSET(tbl_RX_P2Coi[[#This Row],[Coinsurance]],1,0)<tbl_RX_P2Coi[[#This Row],[Coinsurance]]),\"Sort Entries from lowest to highest\",\"\")))","v":""}]
[null,null,null,null,null,null,null,null,null,null,"Total",{"$f":"SUBTOTAL(109,tbl_IPINN_P2Coi[Allowed Claims])","v":0},{"$f":"SUBTOTAL(109,tbl_IPINN_P2Coi[Portion])","v":0},null,{"$f":"IF(AND(tbl_IPINN_P2Coi[[#Totals],[Allowed Claims]]<L71,N71<>\"Fail\",N71<>\"N/A\"),\"Add missing cost share values.\",IF(L105>M55,\"Allowed claims higher than possible; correct entries.\",\"\"))","v":""},null,null,null,null,"Total",{"$f":"SUBTOTAL(109,tbl_IPOON_P2Coi[Allowed Claims])","v":0},{"$f":"SUBTOTAL(109,tbl_IPOON_P2Coi[Portion])","v":0},null,{"$f":"IF(AND(tbl_IPOON_P2Coi[[#Totals],[Allowed Claims]]<U71,W71<>\"Fail\",W71<>\"N/A\"),\"Add missing cost share values.\",IF(U105>V55,\"Allowed claims higher than possible; correct entries.\",\"\"))","v":""},null,null,null,null,"Total",{"$f":"SUBTOTAL(109,tbl_OPINN_P2Coi[Allowed Claims])","v":0},{"$f":"SUBTOTAL(109,tbl_OPINN_P2Coi[Portion])","v":0},null,{"$f":"IF(AND(tbl_OPINN_P2Coi[[#Totals],[Allowed Claims]]<AD71,AF71<>\"Fail\",AF71<>\"N/A\"),\"Add missing cost share values.\",IF(AD105>AE55,\"Allowed claims higher than possible; correct entries.\",\"\"))","v":""},null,null,null,null,"Total",{"$f":"SUBTOTAL(109,tbl_OPOVINN_P2Coi[Allowed Claims])","v":0},{"$f":"SUBTOTAL(109,tbl_OPOVINN_P2Coi[Portion])","v":0},null,{"$f":"IF(AND(tbl_OPOVINN_P2Coi[[#Totals],[Allowed Claims]]<AM71,AO71<>\"Fail\",AO71<>\"N/A\"),\"Add missing cost share values.\",IF(AM105>AN55,\"Allowed claims higher than possible; correct entries.\",\"\"))","v":""},null,null,null,null,"Total",{"$f":"SUBTOTAL(109,tbl_OPAOINN_P2Coi[Allowed Claims])","v":0},{"$f":"SUBTOTAL(109,tbl_OPAOINN_P2Coi[Portion])","v":0},null,{"$f":"IF(AND(tbl_OPAOINN_P2Coi[[#Totals],[Allowed Claims]]<AV71,AX71<>\"Fail\",AX71<>\"N/A\"),\"Add missing cost share values.\",IF(AV105>AW55,\"Allowed claims higher than possible; correct entries.\",\"\"))","v":""},null,null,null,null,"Total",{"$f":"SUBTOTAL(109,tbl_OPOON_P2Coi[Allowed Claims])","v":0},{"$f":"SUBTOTAL(109,tbl_OPOON_P2Coi[Portion])","v":0},null,{"$f":"IF(AND(tbl_OPOON_P2Coi[[#Totals],[Allowed Claims]]<BE71,BG71<>\"Fail\",BG71<>\"N/A\"),\"Add missing cost share values.\",IF(BE105>BF55,\"Allowed claims higher than possible; correct entries.\",\"\"))","v":""},null,null,null,null,"Total",{"$f":"SUBTOTAL(109,tbl_OPOVOON_P2Coi[Allowed Claims])","v":0},{"$f":"SUBTOTAL(109,tbl_OPOVOON_P2Coi[Portion])","v":0},null,{"$f":"IF(AND(tbl_OPOVOON_P2Coi[[#Totals],[Allowed Claims]]<BN71,BP71<>\"Fail\",BP71<>\"N/A\"),\"Add missing cost share values.\",IF(BN105>BO55,\"Allowed claims higher than possible; correct entries.\",\"\"))","v":""},null,null,null,null,"Total",{"$f":"SUBTOTAL(109,tbl_OPAOOON_P2Coi[Allowed Claims])","v":0},{"$f":"SUBTOTAL(109,tbl_OPAOOON_P2Coi[Portion])","v":0},null,{"$f":"IF(AND(tbl_OPAOOON_P2Coi[[#Totals],[Allowed Claims]]<BW71,BY71<>\"Fail\",BY71<>\"N/A\"),\"Add missing cost share values.\",IF(BW105>BX55,\"Allowed claims higher than possible; correct entries.\",\"\"))","v":""},null,null,null,null,"Total",{"$f":"SUBTOTAL(109,tbl_ER_P2Coi[Allowed Claims])","v":0},{"$f":"SUBTOTAL(109,tbl_ER_P2Coi[Portion])","v":0},null,{"$f":"IF(AND(tbl_ER_P2Coi[[#Totals],[Allowed Claims]]<CF71,CH71<>\"Fail\",CH71<>\"N/A\"),\"Add missing cost share values.\",IF(CF105>CG55,\"Allowed claims higher than possible; correct entries.\",\"\"))","v":""},null,null,null,null,"Total",{"$f":"SUBTOTAL(109,tbl_RX_P2Coi[Allowed Claims])","v":0},{"$f":"SUBTOTAL(109,tbl_RX_P2Coi[Portion])","v":0},null,{"$f":"IF(AND(tbl_RX_P2Coi[[#Totals],[Allowed Claims]]<CO71,CQ71<>\"Fail\",CQ71<>\"N/A\"),\"Add missing cost share values.\",IF(CO105>CP55,\"Allowed claims higher than possible; correct entries.\",\"\"))","v":""}]
[]
[null,null,null,null,null,null,null,null,null,null,{"$f":"K111&\" ---- \"&L$40","v":"OOPM ---- (1) Inpatient, In-Network (IP INN)"},null,null,"Errors found:",{"$f":"COUNTIF(tbl_IPINN_P2OOPM[[#Data],[#Totals],[Error Checking]],\"?*\")","v":0},null,null,null,null,{"$f":"T111&\" ---- \"&U$40","v":"OOPM ---- (2) Inpatient, Out-of-Network (IP OON)"},null,null,"Errors found:",{"$f":"COUNTIF(tbl_IPOON_P2OOPM[[#Data],[#Totals],[Error Checking]],\"?*\")","v":0},null,null,null,null,{"$f":"AC111&\" ---- \"&AD$40","v":"OOPM ---- (3) Outpatient, In-Network (OP INN)"},null,null,"Errors found:",{"$f":"COUNTIF(tbl_OPINN_P2OOPM[[#Data],[#Totals],[Error Checking]],\"?*\")","v":0},null,null,null,null,{"$f":"AL111&\" ---- \"&AM$40","v":"OOPM ---- (3a) Outpatient - Office Visits, In-Network (OP-OV INN)"},null,null,"Errors found:",{"$f":"COUNTIF(tbl_OPOVINN_P2OOPM[[#Data],[#Totals],[Error Checking]],\"?*\")","v":0},null,null,null,null,{"$f":"AU111&\" ---- \"&AV$40","v":"OOPM ---- (3b) Outpatient - All Other, In-Network (OP-AO INN)"},null,null,"Errors found:",{"$f":"COUNTIF(tbl_OPAOINN_P2OOPM[[#Data],[#Totals],[Error Checking]],\"?*\")","v":0},null,null,null,null,{"$f":"BD111&\" ---- \"&BE$40","v":"OOPM ---- (4) Outpatient, Out-of-Network (OP OON)"},null,null,"Errors found:",{"$f":"COUNTIF(tbl_OPOON_P2OOPM[[#Data],[#Totals],[Error Checking]],\"?*\")","v":0},null,null,null,null,{"$f":"BM111&\" ---- \"&BN$40","v":"OOPM ---- (4a) Outpatient - Office Visits, Out-of-Network (OP-OV OON)"},null,null,"Errors found:",{"$f":"COUNTIF(tbl_OPOVOON_P2OOPM[[#Data],[#Totals],[Error Checking]],\"?*\")","v":0},null,null,null,null,{"$f":"BV111&\" ---- \"&BW$40","v":"OOPM ---- (4b) Outpatient - All Other, Out-of-Network (OP-AO OON)"},null,null,"Errors found:",{"$f":"COUNTIF(tbl_OPAOOON_P2OOPM[[#Data],[#Totals],[Error Checking]],\"?*\")","v":0},null,null,null,null,{"$f":"CE111&\" ---- \"&CF$40","v":"OOPM ---- (5) Emergency Care,  (ER )"},null,null,"Errors found:",{"$f":"COUNTIF(tbl_ER_P2OOPM[[#Data],[#Totals],[Error Checking]],\"?*\")","v":0},null,null,null,null,{"$f":"CN111&\" ---- \"&CO$40","v":"OOPM ---- (6) Prescription Drugs,  (RX )"},null,null,"Errors found:",{"$f":"COUNTIF(tbl_RX_P2OOPM[[#Data],[#Totals],[Error Checking]],\"?*\")","v":0}]
[null,null,null,null,null,null,null,null,null,null,{"$f":"IF(INDEX(M$69:M$72,MATCH(K111,K$69:K$72,0))=\"\",\"If testing is required for this benefit classification: \nPlease ensure each different cost-share combination is entered above in PART 1.\",IF(INDEX(M$69:M$72,MATCH(K111,K$69:K$72,0))>=(2/3),\"Applies to substantially all medical/surgical benefits in this classification.\nENTER different \"&LOWER(K111)&\" amounts from smallest to largest.\",\"Does not apply to substantially all medical/surgical benefits in this classification. \nDELETE any values in the left-hand column below.\"))","v":"If testing is required for this benefit classification: \nPlease ensure each different cost-share combination is entered above in PART 1."},null,null,null,null,null,null,null,null,{"$f":"IF(INDEX(V$69:V$72,MATCH(T111,T$69:T$72,0))=\"\",\"If testing is required for this benefit classification: \nPlease ensure each different cost-share combination is entered above in PART 1.\",IF(INDEX(V$69:V$72,MATCH(T111,T$69:T$72,0))>=(2/3),\"Applies to substantially all medical/surgical benefits in this classification.\nENTER different \"&LOWER(T111)&\" amounts from smallest to largest.\",\"Does not apply to substantially all medical/surgical benefits in this classification. \nDELETE any values in the left-hand column below.\"))","v":"If testing is required for this benefit classification: \nPlease ensure each different cost-share combination is entered above in PART 1."},null,null,null,null,null,null,null,null,{"$f":"IF(INDEX(AE$69:AE$72,MATCH(AC111,AC$69:AC$72,0))=\"\",\"If testing is required for this benefit classification: \nPlease ensure each different cost-share combination is entered above in PART 1.\",IF(INDEX(AE$69:AE$72,MATCH(AC111,AC$69:AC$72,0))>=(2/3),\"Applies to substantially all medical/surgical benefits in this classification.\nENTER different \"&LOWER(AC111)&\" amounts from smallest to largest.\",\"Does not apply to substantially all medical/surgical benefits in this classification. \nDELETE any values in the left-hand column below.\"))","v":"If testing is required for this benefit classification: \nPlease ensure each different cost-share combination is entered above in PART 1."},null,null,null,null,null,null,null,null,{"$f":"IF(INDEX(AN$69:AN$72,MATCH(AL111,AL$69:AL$72,0))=\"\",\"If testing is required for this benefit classification: \nPlease ensure each different cost-share combination is entered above in PART 1.\",IF(INDEX(AN$69:AN$72,MATCH(AL111,AL$69:AL$72,0))>=(2/3),\"Applies to substantially all medical/surgical benefits in this classification.\nENTER different \"&LOWER(AL111)&\" amounts from smallest to largest.\",\"Does not apply to substantially all medical/surgical benefits in this classification. \nDELETE any values in the left-hand column below.\"))","v":"If testing is required for this benefit classification: \nPlease ensure each different cost-share combination is entered above in PART 1."},null,null,null,null,null,null,null,null,{"$f":"IF(INDEX(AW$69:AW$72,MATCH(AU111,AU$69:AU$72,0))=\"\",\"If testing is required for this benefit classification: \nPlease ensure each different cost-share combination is entered above in PART 1.\",IF(INDEX(AW$69:AW$72,MATCH(AU111,AU$69:AU$72,0))>=(2/3),\"Applies to substantially all medical/surgical benefits in this classification.\nENTER different \"&LOWER(AU111)&\" amounts from smallest to largest.\",\"Does not apply to substantially all medical/surgical benefits in this classification. \nDELETE any values in the left-hand column below.\"))","v":"If testing is required for this benefit classification: \nPlease ensure each different cost-share combination is entered above in PART 1."},null,null,null,null,null,null,null,null,{"$f":"IF(INDEX(BF$69:BF$72,MATCH(BD111,BD$69:BD$72,0))=\"\",\"If testing is required for this benefit classification: \nPlease ensure each different cost-share combination is entered above in PART 1.\",IF(INDEX(BF$69:BF$72,MATCH(BD111,BD$69:BD$72,0))>=(2/3),\"Applies to substantially all medical/surgical benefits in this classification.\nENTER different \"&LOWER(BD111)&\" amounts from smallest to largest.\",\"Does not apply to substantially all medical/surgical benefits in this classification. \nDELETE any values in the left-hand column below.\"))","v":"If testing is required for this benefit classification: \nPlease ensure each different cost-share combination is entered above in PART 1."},null,null,null,null,null,null,null,null,{"$f":"IF(INDEX(BO$69:BO$72,MATCH(BM111,BM$69:BM$72,0))=\"\",\"If testing is required for this benefit classification: \nPlease ensure each different cost-share combination is entered above in PART 1.\",IF(INDEX(BO$69:BO$72,MATCH(BM111,BM$69:BM$72,0))>=(2/3),\"Applies to substantially all medical/surgical benefits in this classification.\nENTER different \"&LOWER(BM111)&\" amounts from smallest to largest.\",\"Does not apply to substantially all medical/surgical benefits in this classification. \nDELETE any values in the left-hand column below.\"))","v":"If testing is required for this benefit classification: \nPlease ensure each different cost-share combination is entered above in PART 1."},null,null,null,null,null,null,null,null,{"$f":"IF(INDEX(BX$69:BX$72,MATCH(BV111,BV$69:BV$72,0))=\"\",\"If testing is required for this benefit classification: \nPlease ensure each different cost-share combination is entered above in PART 1.\",IF(INDEX(BX$69:BX$72,MATCH(BV111,BV$69:BV$72,0))>=(2/3),\"Applies to substantially all medical/surgical benefits in this classification.\nENTER different \"&LOWER(BV111)&\" amounts from smallest to largest.\",\"Does not apply to substantially all medical/surgical benefits in this classification. \nDELETE any values in the left-hand column below.\"))","v":"If testing is required for this benefit classification: \nPlease ensure each different cost-share combination is entered above in PART 1."},null,null,null,null,null,null,null,null,{"$f":"IF(INDEX(CG$69:CG$72,MATCH(CE111,CE$69:CE$72,0))=\"\",\"If testing is required for this benefit classification: \nPlease ensure each different cost-share combination is entered above in PART 1.\",IF(INDEX(CG$69:CG$72,MATCH(CE111,CE$69:CE$72,0))>=(2/3),\"Applies to substantially all medical/surgical benefits in this classification.\nENTER different \"&LOWER(CE111)&\" amounts from smallest to largest.\",\"Does not apply to substantially all medical/surgical benefits in this classification. \nDELETE any values in the left-hand column below.\"))","v":"If testing is required for this benefit classification: \nPlease ensure each different cost-share combination is entered above in PART 1."},null,null,null,null,null,null,null,null,{"$f":"IF(INDEX(CP$69:CP$72,MATCH(CN111,CN$69:CN$72,0))=\"\",\"If testing is required for this benefit classification: \nPlease ensure each different cost-share combination is entered above in PART 1.\",IF(INDEX(CP$69:CP$72,MATCH(CN111,CN$69:CN$72,0))>=(2/3),\"Applies to substantially all medical/surgical benefits in this classification.\nENTER different \"&LOWER(CN111)&\" amounts from smallest to largest.\",\"Does not apply to substantially all medical/surgical benefits in this classification. \nDELETE any values in the left-hand column below.\"))","v":"If testing is required for this benefit classification: \nPlease ensure each different cost-share combination is entered above in PART 1."}]
[]
[]
[null,null,null,null,null,null,null,null,null,null,"OOPM","Allowed Claims","Portion","Predominant & Smaller","Error Checking",null,null,null,null,"OOPM","Allowed Claims","Portion","Predominant & Smaller","Error Checking",null,null,null,null,"OOPM","Allowed Claims","Portion","Predominant & Smaller","Error Checking",null,null,null,null,"OOPM","Allowed Claims","Portion","Predominant & Smaller","Error Checking",null,null,null,null,"OOPM","Allowed Claims","Portion","Predominant & Smaller","Error Checking",null,null,null,null,"OOPM","Allowed Claims","Portion","Predominant & Smaller","Error Checking",null,null,null,null,"OOPM","Allowed Claims","Portion","Predominant & Smaller","Error Checking",null,null,null,null,"OOPM","Allowed Claims","Portion","Predominant & Smaller","Error Checking",null,null,null,null,"OOPM","Allowed Claims","Portion","Predominant & Smaller","Error Checking",null,null,null,null,"OOPM","Allowed Claims","Portion","Predominant & Smaller","Error Checking"]
[null,null,null,null,null,null,null,null,null,null,null,{"$f":"SUMIF(tbl_IPINN_P1[Out-of-Pocket Maximum (OOPM)],K112,tbl_IPINN_P1[Plan Projected Allowed Amount])","v":0},{"$f":"IF(OR(L112=0,L112=\"\"),\"\",L112/tbl_IPINN_P2OOPM[[#Totals],[Allowed Claims]])","v":""},{"$f":"IF(M112=\"\",\"\",IF(SUMIF(tbl_IPINN_P2OOPM[OOPM],\">=\"&K112,tbl_IPINN_P2OOPM[Portion])>0.5,K112,\"\"))","v":""},{"$f":"IF(COUNTIF(tbl_IPINN_P2OOPM[OOPM],tbl_IPINN_P2OOPM[[#This Row],[OOPM]])>1,\"Remove Duplicate Entry.\",IF(AND(tbl_IPINN_P2OOPM[[#This Row],[OOPM]]<>\"\",tbl_IPINN_P2OOPM[[#This Row],[Allowed Claims]]=0),\"Entry not found in Part 1 Table\",IF(AND(OFFSET(tbl_IPINN_P2OOPM[[#This Row],[OOPM]],1,0)<>\"Total\",OFFSET(tbl_IPINN_P2OOPM[[#This Row],[OOPM]],1,0)<>\"\",OFFSET(tbl_IPINN_P2OOPM[[#This Row],[OOPM]],1,0)<tbl_IPINN_P2OOPM[[#This Row],[OOPM]]),\"Sort Entries from lowest to highest\",\"\")))","v":""},null,null,null,null,null,{"$f":"SUMIF(tbl_IPOON_P1[Out-of-Pocket Maximum (OOPM)],T112,tbl_IPOON_P1[Plan Projected Allowed Amount])","v":0},{"$f":"IF(OR(U112=0,U112=\"\"),\"\",U112/tbl_IPOON_P2OOPM[[#Totals],[Allowed Claims]])","v":""},{"$f":"IF(V112=\"\",\"\",IF(SUMIF(tbl_IPOON_P2OOPM[OOPM],\">=\"&T112,tbl_IPOON_P2OOPM[Portion])>0.5,T112,\"\"))","v":""},{"$f":"IF(COUNTIF(tbl_IPOON_P2OOPM[OOPM],tbl_IPOON_P2OOPM[[#This Row],[OOPM]])>1,\"Remove Duplicate Entry.\",IF(AND(tbl_IPOON_P2OOPM[[#This Row],[OOPM]]<>\"\",tbl_IPOON_P2OOPM[[#This Row],[Allowed Claims]]=0),\"Entry not found in Part 1 Table\",IF(AND(OFFSET(tbl_IPOON_P2OOPM[[#This Row],[OOPM]],1,0)<>\"Total\",OFFSET(tbl_IPOON_P2OOPM[[#This Row],[OOPM]],1,0)<>\"\",OFFSET(tbl_IPOON_P2OOPM[[#This Row],[OOPM]],1,0)<tbl_IPOON_P2OOPM[[#This Row],[OOPM]]),\"Sort Entries from lowest to highest\",\"\")))","v":""},null,null,null,null,null,{"$f":"SUMIF(tbl_OPINN_P1[Out-of-Pocket Maximum (OOPM)],AC112,tbl_OPINN_P1[Plan Projected Allowed Amount])","v":0},{"$f":"IF(OR(AD112=0,AD112=\"\"),\"\",AD112/tbl_OPINN_P2OOPM[[#Totals],[Allowed Claims]])","v":""},{"$f":"IF(AE112=\"\",\"\",IF(SUMIF(tbl_OPINN_P2OOPM[OOPM],\">=\"&AC112,tbl_OPINN_P2OOPM[Portion])>0.5,AC112,\"\"))","v":""},{"$f":"IF(COUNTIF(tbl_OPINN_P2OOPM[OOPM],tbl_OPINN_P2OOPM[[#This Row],[OOPM]])>1,\"Remove Duplicate Entry.\",IF(AND(tbl_OPINN_P2OOPM[[#This Row],[OOPM]]<>\"\",tbl_OPINN_P2OOPM[[#This Row],[Allowed Claims]]=0),\"Entry not found in Part 1 Table\",IF(AND(OFFSET(tbl_OPINN_P2OOPM[[#This Row],[OOPM]],1,0)<>\"Total\",OFFSET(tbl_OPINN_P2OOPM[[#This Row],[OOPM]],1,0)<>\"\",OFFSET(tbl_OPINN_P2OOPM[[#This Row],[OOPM]],1,0)<tbl_OPINN_P2OOPM[[#This Row],[OOPM]]),\"Sort Entries from lowest to highest\",\"\")))","v":""},null,null,null,null,null,{"$f":"SUMIF(tbl_OPOVINN_P1[Out-of-Pocket Maximum (OOPM)],AL112,tbl_OPOVINN_P1[Plan Projected Allowed Amount])","v":0},{"$f":"IF(OR(AM112=0,AM112=\"\"),\"\",AM112/tbl_OPOVINN_P2OOPM[[#Totals],[Allowed Claims]])","v":""},{"$f":"IF(AN112=\"\",\"\",IF(SUMIF(tbl_OPOVINN_P2OOPM[OOPM],\">=\"&AL112,tbl_OPOVINN_P2OOPM[Portion])>0.5,AL112,\"\"))","v":""},{"$f":"IF(COUNTIF(tbl_OPOVINN_P2OOPM[OOPM],tbl_OPOVINN_P2OOPM[[#This Row],[OOPM]])>1,\"Remove Duplicate Entry.\",IF(AND(tbl_OPOVINN_P2OOPM[[#This Row],[OOPM]]<>\"\",tbl_OPOVINN_P2OOPM[[#This Row],[Allowed Claims]]=0),\"Entry not found in Part 1 Table\",IF(AND(OFFSET(tbl_OPOVINN_P2OOPM[[#This Row],[OOPM]],1,0)<>\"Total\",OFFSET(tbl_OPOVINN_P2OOPM[[#This Row],[OOPM]],1,0)<>\"\",OFFSET(tbl_OPOVINN_P2OOPM[[#This Row],[OOPM]],1,0)<tbl_OPOVINN_P2OOPM[[#This Row],[OOPM]]),\"Sort Entries from lowest to highest\",\"\")))","v":""},null,null,null,null,null,{"$f":"SUMIF(tbl_OPAOINN_P1[Out-of-Pocket Maximum (OOPM)],AU112,tbl_OPAOINN_P1[Plan Projected Allowed Amount])","v":0},{"$f":"IF(OR(AV112=0,AV112=\"\"),\"\",AV112/tbl_OPAOINN_P2OOPM[[#Totals],[Allowed Claims]])","v":""},{"$f":"IF(AW112=\"\",\"\",IF(SUMIF(tbl_OPAOINN_P2OOPM[OOPM],\">=\"&AU112,tbl_OPAOINN_P2OOPM[Portion])>0.5,AU112,\"\"))","v":""},{"$f":"IF(COUNTIF(tbl_OPAOINN_P2OOPM[OOPM],tbl_OPAOINN_P2OOPM[[#This Row],[OOPM]])>1,\"Remove Duplicate Entry.\",IF(AND(tbl_OPAOINN_P2OOPM[[#This Row],[OOPM]]<>\"\",tbl_OPAOINN_P2OOPM[[#This Row],[Allowed Claims]]=0),\"Entry not found in Part 1 Table\",IF(AND(OFFSET(tbl_OPAOINN_P2OOPM[[#This Row],[OOPM]],1,0)<>\"Total\",OFFSET(tbl_OPAOINN_P2OOPM[[#This Row],[OOPM]],1,0)<>\"\",OFFSET(tbl_OPAOINN_P2OOPM[[#This Row],[OOPM]],1,0)<tbl_OPAOINN_P2OOPM[[#This Row],[OOPM]]),\"Sort Entries from lowest to highest\",\"\")))","v":""},null,null,null,null,null,{"$f":"SUMIF(tbl_OPOON_P1[Out-of-Pocket Maximum (OOPM)],BD112,tbl_OPOON_P1[Plan Projected Allowed Amount])","v":0},{"$f":"IF(OR(BE112=0,BE112=\"\"),\"\",BE112/tbl_OPOON_P2OOPM[[#Totals],[Allowed Claims]])","v":""},{"$f":"IF(BF112=\"\",\"\",IF(SUMIF(tbl_OPOON_P2OOPM[OOPM],\">=\"&BD112,tbl_OPOON_P2OOPM[Portion])>0.5,BD112,\"\"))","v":""},{"$f":"IF(COUNTIF(tbl_OPOON_P2OOPM[OOPM],tbl_OPOON_P2OOPM[[#This Row],[OOPM]])>1,\"Remove Duplicate Entry.\",IF(AND(tbl_OPOON_P2OOPM[[#This Row],[OOPM]]<>\"\",tbl_OPOON_P2OOPM[[#This Row],[Allowed Claims]]=0),\"Entry not found in Part 1 Table\",IF(AND(OFFSET(tbl_OPOON_P2OOPM[[#This Row],[OOPM]],1,0)<>\"Total\",OFFSET(tbl_OPOON_P2OOPM[[#This Row],[OOPM]],1,0)<>\"\",OFFSET(tbl_OPOON_P2OOPM[[#This Row],[OOPM]],1,0)<tbl_OPOON_P2OOPM[[#This Row],[OOPM]]),\"Sort Entries from lowest to highest\",\"\")))","v":""},null,null,null,null,null,{"$f":"SUMIF(tbl_OPOVOON_P1[Out-of-Pocket Maximum (OOPM)],BM112,tbl_OPOVOON_P1[Plan Projected Allowed Amount])","v":0},{"$f":"IF(OR(BN112=0,BN112=\"\"),\"\",BN112/tbl_OPOVOON_P2OOPM[[#Totals],[Allowed Claims]])","v":""},{"$f":"IF(BO112=\"\",\"\",IF(SUMIF(tbl_OPOVOON_P2OOPM[OOPM],\">=\"&BM112,tbl_OPOVOON_P2OOPM[Portion])>0.5,BM112,\"\"))","v":""},{"$f":"IF(COUNTIF(tbl_OPOVOON_P2OOPM[OOPM],tbl_OPOVOON_P2OOPM[[#This Row],[OOPM]])>1,\"Remove Duplicate Entry.\",IF(AND(tbl_OPOVOON_P2OOPM[[#This Row],[OOPM]]<>\"\",tbl_OPOVOON_P2OOPM[[#This Row],[Allowed Claims]]=0),\"Entry not found in Part 1 Table\",IF(AND(OFFSET(tbl_OPOVOON_P2OOPM[[#This Row],[OOPM]],1,0)<>\"Total\",OFFSET(tbl_OPOVOON_P2OOPM[[#This Row],[OOPM]],1,0)<>\"\",OFFSET(tbl_OPOVOON_P2OOPM[[#This Row],[OOPM]],1,0)<tbl_OPOVOON_P2OOPM[[#This Row],[OOPM]]),\"Sort Entries from lowest to highest\",\"\")))","v":""},null,null,null,null,null,{"$f":"SUMIF(tbl_OPAOOON_P1[Out-of-Pocket Maximum (OOPM)],BV112,tbl_OPAOOON_P1[Plan Projected Allowed Amount])","v":0},{"$f":"IF(OR(BW112=0,BW112=\"\"),\"\",BW112/tbl_OPAOOON_P2OOPM[[#Totals],[Allowed Claims]])","v":""},{"$f":"IF(BX112=\"\",\"\",IF(SUMIF(tbl_OPAOOON_P2OOPM[OOPM],\">=\"&BV112,tbl_OPAOOON_P2OOPM[Portion])>0.5,BV112,\"\"))","v":""},{"$f":"IF(COUNTIF(tbl_OPAOOON_P2OOPM[OOPM],tbl_OPAOOON_P2OOPM[[#This Row],[OOPM]])>1,\"Remove Duplicate Entry.\",IF(AND(tbl_OPAOOON_P2OOPM[[#This Row],[OOPM]]<>\"\",tbl_OPAOOON_P2OOPM[[#This Row],[Allowed Claims]]=0),\"Entry not found in Part 1 Table\",IF(AND(OFFSET(tbl_OPAOOON_P2OOPM[[#This Row],[OOPM]],1,0)<>\"Total\",OFFSET(tbl_OPAOOON_P2OOPM[[#This Row],[OOPM]],1,0)<>\"\",OFFSET(tbl_OPAOOON_P2OOPM[[#This Row],[OOPM]],1,0)<tbl_OPAOOON_P2OOPM[[#This Row],[OOPM]]),\"Sort Entries from lowest to highest\",\"\")))","v":""},null,null,null,null,null,{"$f":"SUMIF(tbl_ER_P1[Out-of-Pocket Maximum (OOPM)],CE112,tbl_ER_P1[Plan Projected Allowed Amount])","v":0},{"$f":"IF(OR(CF112=0,CF112=\"\"),\"\",CF112/tbl_ER_P2OOPM[[#Totals],[Allowed Claims]])","v":""},{"$f":"IF(CG112=\"\",\"\",IF(SUMIF(tbl_ER_P2OOPM[OOPM],\">=\"&CE112,tbl_ER_P2OOPM[Portion])>0.5,CE112,\"\"))","v":""},{"$f":"IF(COUNTIF(tbl_ER_P2OOPM[OOPM],tbl_ER_P2OOPM[[#This Row],[OOPM]])>1,\"Remove Duplicate Entry.\",IF(AND(tbl_ER_P2OOPM[[#This Row],[OOPM]]<>\"\",tbl_ER_P2OOPM[[#This Row],[Allowed Claims]]=0),\"Entry not found in Part 1 Table\",IF(AND(OFFSET(tbl_ER_P2OOPM[[#This Row],[OOPM]],1,0)<>\"Total\",OFFSET(tbl_ER_P2OOPM[[#This Row],[OOPM]],1,0)<>\"\",OFFSET(tbl_ER_P2OOPM[[#This Row],[OOPM]],1,0)<tbl_ER_P2OOPM[[#This Row],[OOPM]]),\"Sort Entries from lowest to highest\",\"\")))","v":""},null,null,null,null,null,{"$f":"SUMIF(tbl_RX_P1[Out-of-Pocket Maximum (OOPM)],CN112,tbl_RX_P1[Plan Projected Allowed Amount])","v":0},{"$f":"IF(OR(CO112=0,CO112=\"\"),\"\",CO112/tbl_RX_P2OOPM[[#Totals],[Allowed Claims]])","v":""},{"$f":"IF(CP112=\"\",\"\",IF(SUMIF(tbl_RX_P2OOPM[OOPM],\">=\"&CN112,tbl_RX_P2OOPM[Portion])>0.5,CN112,\"\"))","v":""},{"$f":"IF(COUNTIF(tbl_RX_P2OOPM[OOPM],tbl_RX_P2OOPM[[#This Row],[OOPM]])>1,\"Remove Duplicate Entry.\",IF(AND(tbl_RX_P2OOPM[[#This Row],[OOPM]]<>\"\",tbl_RX_P2OOPM[[#This Row],[Allowed Claims]]=0),\"Entry not found in Part 1 Table\",IF(AND(OFFSET(tbl_RX_P2OOPM[[#This Row],[OOPM]],1,0)<>\"Total\",OFFSET(tbl_RX_P2OOPM[[#This Row],[OOPM]],1,0)<>\"\",OFFSET(tbl_RX_P2OOPM[[#This Row],[OOPM]],1,0)<tbl_RX_P2OOPM[[#This Row],[OOPM]]),\"Sort Entries from lowest to highest\",\"\")))","v":""}]
[null,null,null,null,null,null,null,null,null,null,null,{"$f":"SUMIF(tbl_IPINN_P1[Out-of-Pocket Maximum (OOPM)],K113,tbl_IPINN_P1[Plan Projected Allowed Amount])","v":0},{"$f":"IF(OR(L113=0,L113=\"\"),\"\",L113/tbl_IPINN_P2OOPM[[#Totals],[Allowed Claims]])","v":""},{"$f":"IF(M113=\"\",\"\",IF(SUMIF(tbl_IPINN_P2OOPM[OOPM],\">=\"&K113,tbl_IPINN_P2OOPM[Portion])>0.5,K113,\"\"))","v":""},{"$f":"IF(COUNTIF(tbl_IPINN_P2OOPM[OOPM],tbl_IPINN_P2OOPM[[#This Row],[OOPM]])>1,\"Remove Duplicate Entry.\",IF(AND(tbl_IPINN_P2OOPM[[#This Row],[OOPM]]<>\"\",tbl_IPINN_P2OOPM[[#This Row],[Allowed Claims]]=0),\"Entry not found in Part 1 Table\",IF(AND(OFFSET(tbl_IPINN_P2OOPM[[#This Row],[OOPM]],1,0)<>\"Total\",OFFSET(tbl_IPINN_P2OOPM[[#This Row],[OOPM]],1,0)<>\"\",OFFSET(tbl_IPINN_P2OOPM[[#This Row],[OOPM]],1,0)<tbl_IPINN_P2OOPM[[#This Row],[OOPM]]),\"Sort Entries from lowest to highest\",\"\")))","v":""},null,null,null,null,null,{"$f":"SUMIF(tbl_IPOON_P1[Out-of-Pocket Maximum (OOPM)],T113,tbl_IPOON_P1[Plan Projected Allowed Amount])","v":0},{"$f":"IF(OR(U113=0,U113=\"\"),\"\",U113/tbl_IPOON_P2OOPM[[#Totals],[Allowed Claims]])","v":""},{"$f":"IF(V113=\"\",\"\",IF(SUMIF(tbl_IPOON_P2OOPM[OOPM],\">=\"&T113,tbl_IPOON_P2OOPM[Portion])>0.5,T113,\"\"))","v":""},{"$f":"IF(COUNTIF(tbl_IPOON_P2OOPM[OOPM],tbl_IPOON_P2OOPM[[#This Row],[OOPM]])>1,\"Remove Duplicate Entry.\",IF(AND(tbl_IPOON_P2OOPM[[#This Row],[OOPM]]<>\"\",tbl_IPOON_P2OOPM[[#This Row],[Allowed Claims]]=0),\"Entry not found in Part 1 Table\",IF(AND(OFFSET(tbl_IPOON_P2OOPM[[#This Row],[OOPM]],1,0)<>\"Total\",OFFSET(tbl_IPOON_P2OOPM[[#This Row],[OOPM]],1,0)<>\"\",OFFSET(tbl_IPOON_P2OOPM[[#This Row],[OOPM]],1,0)<tbl_IPOON_P2OOPM[[#This Row],[OOPM]]),\"Sort Entries from lowest to highest\",\"\")))","v":""},null,null,null,null,null,{"$f":"SUMIF(tbl_OPINN_P1[Out-of-Pocket Maximum (OOPM)],AC113,tbl_OPINN_P1[Plan Projected Allowed Amount])","v":0},{"$f":"IF(OR(AD113=0,AD113=\"\"),\"\",AD113/tbl_OPINN_P2OOPM[[#Totals],[Allowed Claims]])","v":""},{"$f":"IF(AE113=\"\",\"\",IF(SUMIF(tbl_OPINN_P2OOPM[OOPM],\">=\"&AC113,tbl_OPINN_P2OOPM[Portion])>0.5,AC113,\"\"))","v":""},{"$f":"IF(COUNTIF(tbl_OPINN_P2OOPM[OOPM],tbl_OPINN_P2OOPM[[#This Row],[OOPM]])>1,\"Remove Duplicate Entry.\",IF(AND(tbl_OPINN_P2OOPM[[#This Row],[OOPM]]<>\"\",tbl_OPINN_P2OOPM[[#This Row],[Allowed Claims]]=0),\"Entry not found in Part 1 Table\",IF(AND(OFFSET(tbl_OPINN_P2OOPM[[#This Row],[OOPM]],1,0)<>\"Total\",OFFSET(tbl_OPINN_P2OOPM[[#This Row],[OOPM]],1,0)<>\"\",OFFSET(tbl_OPINN_P2OOPM[[#This Row],[OOPM]],1,0)<tbl_OPINN_P2OOPM[[#This Row],[OOPM]]),\"Sort Entries from lowest to highest\",\"\")))","v":""},null,null,null,null,null,{"$f":"SUMIF(tbl_OPOVINN_P1[Out-of-Pocket Maximum (OOPM)],AL113,tbl_OPOVINN_P1[Plan Projected Allowed Amount])","v":0},{"$f":"IF(OR(AM113=0,AM113=\"\"),\"\",AM113/tbl_OPOVINN_P2OOPM[[#Totals],[Allowed Claims]])","v":""},{"$f":"IF(AN113=\"\",\"\",IF(SUMIF(tbl_OPOVINN_P2OOPM[OOPM],\">=\"&AL113,tbl_OPOVINN_P2OOPM[Portion])>0.5,AL113,\"\"))","v":""},{"$f":"IF(COUNTIF(tbl_OPOVINN_P2OOPM[OOPM],tbl_OPOVINN_P2OOPM[[#This Row],[OOPM]])>1,\"Remove Duplicate Entry.\",IF(AND(tbl_OPOVINN_P2OOPM[[#This Row],[OOPM]]<>\"\",tbl_OPOVINN_P2OOPM[[#This Row],[Allowed Claims]]=0),\"Entry not found in Part 1 Table\",IF(AND(OFFSET(tbl_OPOVINN_P2OOPM[[#This Row],[OOPM]],1,0)<>\"Total\",OFFSET(tbl_OPOVINN_P2OOPM[[#This Row],[OOPM]],1,0)<>\"\",OFFSET(tbl_OPOVINN_P2OOPM[[#This Row],[OOPM]],1,0)<tbl_OPOVINN_P2OOPM[[#This Row],[OOPM]]),\"Sort Entries from lowest to highest\",\"\")))","v":""},null,null,null,null,null,{"$f":"SUMIF(tbl_OPAOINN_P1[Out-of-Pocket Maximum (OOPM)],AU113,tbl_OPAOINN_P1[Plan Projected Allowed Amount])","v":0},{"$f":"IF(OR(AV113=0,AV113=\"\"),\"\",AV113/tbl_OPAOINN_P2OOPM[[#Totals],[Allowed Claims]])","v":""},{"$f":"IF(AW113=\"\",\"\",IF(SUMIF(tbl_OPAOINN_P2OOPM[OOPM],\">=\"&AU113,tbl_OPAOINN_P2OOPM[Portion])>0.5,AU113,\"\"))","v":""},{"$f":"IF(COUNTIF(tbl_OPAOINN_P2OOPM[OOPM],tbl_OPAOINN_P2OOPM[[#This Row],[OOPM]])>1,\"Remove Duplicate Entry.\",IF(AND(tbl_OPAOINN_P2OOPM[[#This Row],[OOPM]]<>\"\",tbl_OPAOINN_P2OOPM[[#This Row],[Allowed Claims]]=0),\"Entry not found in Part 1 Table\",IF(AND(OFFSET(tbl_OPAOINN_P2OOPM[[#This Row],[OOPM]],1,0)<>\"Total\",OFFSET(tbl_OPAOINN_P2OOPM[[#This Row],[OOPM]],1,0)<>\"\",OFFSET(tbl_OPAOINN_P2OOPM[[#This Row],[OOPM]],1,0)<tbl_OPAOINN_P2OOPM[[#This Row],[OOPM]]),\"Sort Entries from lowest to highest\",\"\")))","v":""},null,null,null,null,null,{"$f":"SUMIF(tbl_OPOON_P1[Out-of-Pocket Maximum (OOPM)],BD113,tbl_OPOON_P1[Plan Projected Allowed Amount])","v":0},{"$f":"IF(OR(BE113=0,BE113=\"\"),\"\",BE113/tbl_OPOON_P2OOPM[[#Totals],[Allowed Claims]])","v":""},{"$f":"IF(BF113=\"\",\"\",IF(SUMIF(tbl_OPOON_P2OOPM[OOPM],\">=\"&BD113,tbl_OPOON_P2OOPM[Portion])>0.5,BD113,\"\"))","v":""},{"$f":"IF(COUNTIF(tbl_OPOON_P2OOPM[OOPM],tbl_OPOON_P2OOPM[[#This Row],[OOPM]])>1,\"Remove Duplicate Entry.\",IF(AND(tbl_OPOON_P2OOPM[[#This Row],[OOPM]]<>\"\",tbl_OPOON_P2OOPM[[#This Row],[Allowed Claims]]=0),\"Entry not found in Part 1 Table\",IF(AND(OFFSET(tbl_OPOON_P2OOPM[[#This Row],[OOPM]],1,0)<>\"Total\",OFFSET(tbl_OPOON_P2OOPM[[#This Row],[OOPM]],1,0)<>\"\",OFFSET(tbl_OPOON_P2OOPM[[#This Row],[OOPM]],1,0)<tbl_OPOON_P2OOPM[[#This Row],[OOPM]]),\"Sort Entries from lowest to highest\",\"\")))","v":""},null,null,null,null,null,{"$f":"SUMIF(tbl_OPOVOON_P1[Out-of-Pocket Maximum (OOPM)],BM113,tbl_OPOVOON_P1[Plan Projected Allowed Amount])","v":0},{"$f":"IF(OR(BN113=0,BN113=\"\"),\"\",BN113/tbl_OPOVOON_P2OOPM[[#Totals],[Allowed Claims]])","v":""},{"$f":"IF(BO113=\"\",\"\",IF(SUMIF(tbl_OPOVOON_P2OOPM[OOPM],\">=\"&BM113,tbl_OPOVOON_P2OOPM[Portion])>0.5,BM113,\"\"))","v":""},{"$f":"IF(COUNTIF(tbl_OPOVOON_P2OOPM[OOPM],tbl_OPOVOON_P2OOPM[[#This Row],[OOPM]])>1,\"Remove Duplicate Entry.\",IF(AND(tbl_OPOVOON_P2OOPM[[#This Row],[OOPM]]<>\"\",tbl_OPOVOON_P2OOPM[[#This Row],[Allowed Claims]]=0),\"Entry not found in Part 1 Table\",IF(AND(OFFSET(tbl_OPOVOON_P2OOPM[[#This Row],[OOPM]],1,0)<>\"Total\",OFFSET(tbl_OPOVOON_P2OOPM[[#This Row],[OOPM]],1,0)<>\"\",OFFSET(tbl_OPOVOON_P2OOPM[[#This Row],[OOPM]],1,0)<tbl_OPOVOON_P2OOPM[[#This Row],[OOPM]]),\"Sort Entries from lowest to highest\",\"\")))","v":""},null,null,null,null,null,{"$f":"SUMIF(tbl_OPAOOON_P1[Out-of-Pocket Maximum (OOPM)],BV113,tbl_OPAOOON_P1[Plan Projected Allowed Amount])","v":0},{"$f":"IF(OR(BW113=0,BW113=\"\"),\"\",BW113/tbl_OPAOOON_P2OOPM[[#Totals],[Allowed Claims]])","v":""},{"$f":"IF(BX113=\"\",\"\",IF(SUMIF(tbl_OPAOOON_P2OOPM[OOPM],\">=\"&BV113,tbl_OPAOOON_P2OOPM[Portion])>0.5,BV113,\"\"))","v":""},{"$f":"IF(COUNTIF(tbl_OPAOOON_P2OOPM[OOPM],tbl_OPAOOON_P2OOPM[[#This Row],[OOPM]])>1,\"Remove Duplicate Entry.\",IF(AND(tbl_OPAOOON_P2OOPM[[#This Row],[OOPM]]<>\"\",tbl_OPAOOON_P2OOPM[[#This Row],[Allowed Claims]]=0),\"Entry not found in Part 1 Table\",IF(AND(OFFSET(tbl_OPAOOON_P2OOPM[[#This Row],[OOPM]],1,0)<>\"Total\",OFFSET(tbl_OPAOOON_P2OOPM[[#This Row],[OOPM]],1,0)<>\"\",OFFSET(tbl_OPAOOON_P2OOPM[[#This Row],[OOPM]],1,0)<tbl_OPAOOON_P2OOPM[[#This Row],[OOPM]]),\"Sort Entries from lowest to highest\",\"\")))","v":""},null,null,null,null,null,{"$f":"SUMIF(tbl_ER_P1[Out-of-Pocket Maximum (OOPM)],CE113,tbl_ER_P1[Plan Projected Allowed Amount])","v":0},{"$f":"IF(OR(CF113=0,CF113=\"\"),\"\",CF113/tbl_ER_P2OOPM[[#Totals],[Allowed Claims]])","v":""},{"$f":"IF(CG113=\"\",\"\",IF(SUMIF(tbl_ER_P2OOPM[OOPM],\">=\"&CE113,tbl_ER_P2OOPM[Portion])>0.5,CE113,\"\"))","v":""},{"$f":"IF(COUNTIF(tbl_ER_P2OOPM[OOPM],tbl_ER_P2OOPM[[#This Row],[OOPM]])>1,\"Remove Duplicate Entry.\",IF(AND(tbl_ER_P2OOPM[[#This Row],[OOPM]]<>\"\",tbl_ER_P2OOPM[[#This Row],[Allowed Claims]]=0),\"Entry not found in Part 1 Table\",IF(AND(OFFSET(tbl_ER_P2OOPM[[#This Row],[OOPM]],1,0)<>\"Total\",OFFSET(tbl_ER_P2OOPM[[#This Row],[OOPM]],1,0)<>\"\",OFFSET(tbl_ER_P2OOPM[[#This Row],[OOPM]],1,0)<tbl_ER_P2OOPM[[#This Row],[OOPM]]),\"Sort Entries from lowest to highest\",\"\")))","v":""},null,null,null,null,null,{"$f":"SUMIF(tbl_RX_P1[Out-of-Pocket Maximum (OOPM)],CN113,tbl_RX_P1[Plan Projected Allowed Amount])","v":0},{"$f":"IF(OR(CO113=0,CO113=\"\"),\"\",CO113/tbl_RX_P2OOPM[[#Totals],[Allowed Claims]])","v":""},{"$f":"IF(CP113=\"\",\"\",IF(SUMIF(tbl_RX_P2OOPM[OOPM],\">=\"&CN113,tbl_RX_P2OOPM[Portion])>0.5,CN113,\"\"))","v":""},{"$f":"IF(COUNTIF(tbl_RX_P2OOPM[OOPM],tbl_RX_P2OOPM[[#This Row],[OOPM]])>1,\"Remove Duplicate Entry.\",IF(AND(tbl_RX_P2OOPM[[#This Row],[OOPM]]<>\"\",tbl_RX_P2OOPM[[#This Row],[Allowed Claims]]=0),\"Entry not found in Part 1 Table\",IF(AND(OFFSET(tbl_RX_P2OOPM[[#This Row],[OOPM]],1,0)<>\"Total\",OFFSET(tbl_RX_P2OOPM[[#This Row],[OOPM]],1,0)<>\"\",OFFSET(tbl_RX_P2OOPM[[#This Row],[OOPM]],1,0)<tbl_RX_P2OOPM[[#This Row],[OOPM]]),\"Sort Entries from lowest to highest\",\"\")))","v":""}]
[null,null,null,null,null,null,null,null,null,null,null,{"$f":"SUMIF(tbl_IPINN_P1[Out-of-Pocket Maximum (OOPM)],K114,tbl_IPINN_P1[Plan Projected Allowed Amount])","v":0},{"$f":"IF(OR(L114=0,L114=\"\"),\"\",L114/tbl_IPINN_P2OOPM[[#Totals],[Allowed Claims]])","v":""},{"$f":"IF(M114=\"\",\"\",IF(SUMIF(tbl_IPINN_P2OOPM[OOPM],\">=\"&K114,tbl_IPINN_P2OOPM[Portion])>0.5,K114,\"\"))","v":""},{"$f":"IF(COUNTIF(tbl_IPINN_P2OOPM[OOPM],tbl_IPINN_P2OOPM[[#This Row],[OOPM]])>1,\"Remove Duplicate Entry.\",IF(AND(tbl_IPINN_P2OOPM[[#This Row],[OOPM]]<>\"\",tbl_IPINN_P2OOPM[[#This Row],[Allowed Claims]]=0),\"Entry not found in Part 1 Table\",IF(AND(OFFSET(tbl_IPINN_P2OOPM[[#This Row],[OOPM]],1,0)<>\"Total\",OFFSET(tbl_IPINN_P2OOPM[[#This Row],[OOPM]],1,0)<>\"\",OFFSET(tbl_IPINN_P2OOPM[[#This Row],[OOPM]],1,0)<tbl_IPINN_P2OOPM[[#This Row],[OOPM]]),\"Sort Entries from lowest to highest\",\"\")))","v":""},null,null,null,null,null,{"$f":"SUMIF(tbl_IPOON_P1[Out-of-Pocket Maximum (OOPM)],T114,tbl_IPOON_P1[Plan Projected Allowed Amount])","v":0},{"$f":"IF(OR(U114=0,U114=\"\"),\"\",U114/tbl_IPOON_P2OOPM[[#Totals],[Allowed Claims]])","v":""},{"$f":"IF(V114=\"\",\"\",IF(SUMIF(tbl_IPOON_P2OOPM[OOPM],\">=\"&T114,tbl_IPOON_P2OOPM[Portion])>0.5,T114,\"\"))","v":""},{"$f":"IF(COUNTIF(tbl_IPOON_P2OOPM[OOPM],tbl_IPOON_P2OOPM[[#This Row],[OOPM]])>1,\"Remove Duplicate Entry.\",IF(AND(tbl_IPOON_P2OOPM[[#This Row],[OOPM]]<>\"\",tbl_IPOON_P2OOPM[[#This Row],[Allowed Claims]]=0),\"Entry not found in Part 1 Table\",IF(AND(OFFSET(tbl_IPOON_P2OOPM[[#This Row],[OOPM]],1,0)<>\"Total\",OFFSET(tbl_IPOON_P2OOPM[[#This Row],[OOPM]],1,0)<>\"\",OFFSET(tbl_IPOON_P2OOPM[[#This Row],[OOPM]],1,0)<tbl_IPOON_P2OOPM[[#This Row],[OOPM]]),\"Sort Entries from lowest to highest\",\"\")))","v":""},null,null,null,null,null,{"$f":"SUMIF(tbl_OPINN_P1[Out-of-Pocket Maximum (OOPM)],AC114,tbl_OPINN_P1[Plan Projected Allowed Amount])","v":0},{"$f":"IF(OR(AD114=0,AD114=\"\"),\"\",AD114/tbl_OPINN_P2OOPM[[#Totals],[Allowed Claims]])","v":""},{"$f":"IF(AE114=\"\",\"\",IF(SUMIF(tbl_OPINN_P2OOPM[OOPM],\">=\"&AC114,tbl_OPINN_P2OOPM[Portion])>0.5,AC114,\"\"))","v":""},{"$f":"IF(COUNTIF(tbl_OPINN_P2OOPM[OOPM],tbl_OPINN_P2OOPM[[#This Row],[OOPM]])>1,\"Remove Duplicate Entry.\",IF(AND(tbl_OPINN_P2OOPM[[#This Row],[OOPM]]<>\"\",tbl_OPINN_P2OOPM[[#This Row],[Allowed Claims]]=0),\"Entry not found in Part 1 Table\",IF(AND(OFFSET(tbl_OPINN_P2OOPM[[#This Row],[OOPM]],1,0)<>\"Total\",OFFSET(tbl_OPINN_P2OOPM[[#This Row],[OOPM]],1,0)<>\"\",OFFSET(tbl_OPINN_P2OOPM[[#This Row],[OOPM]],1,0)<tbl_OPINN_P2OOPM[[#This Row],[OOPM]]),\"Sort Entries from lowest to highest\",\"\")))","v":""},null,null,null,null,null,{"$f":"SUMIF(tbl_OPOVINN_P1[Out-of-Pocket Maximum (OOPM)],AL114,tbl_OPOVINN_P1[Plan Projected Allowed Amount])","v":0},{"$f":"IF(OR(AM114=0,AM114=\"\"),\"\",AM114/tbl_OPOVINN_P2OOPM[[#Totals],[Allowed Claims]])","v":""},{"$f":"IF(AN114=\"\",\"\",IF(SUMIF(tbl_OPOVINN_P2OOPM[OOPM],\">=\"&AL114,tbl_OPOVINN_P2OOPM[Portion])>0.5,AL114,\"\"))","v":""},{"$f":"IF(COUNTIF(tbl_OPOVINN_P2OOPM[OOPM],tbl_OPOVINN_P2OOPM[[#This Row],[OOPM]])>1,\"Remove Duplicate Entry.\",IF(AND(tbl_OPOVINN_P2OOPM[[#This Row],[OOPM]]<>\"\",tbl_OPOVINN_P2OOPM[[#This Row],[Allowed Claims]]=0),\"Entry not found in Part 1 Table\",IF(AND(OFFSET(tbl_OPOVINN_P2OOPM[[#This Row],[OOPM]],1,0)<>\"Total\",OFFSET(tbl_OPOVINN_P2OOPM[[#This Row],[OOPM]],1,0)<>\"\",OFFSET(tbl_OPOVINN_P2OOPM[[#This Row],[OOPM]],1,0)<tbl_OPOVINN_P2OOPM[[#This Row],[OOPM]]),\"Sort Entries from lowest to highest\",\"\")))","v":""},null,null,null,null,null,{"$f":"SUMIF(tbl_OPAOINN_P1[Out-of-Pocket Maximum (OOPM)],AU114,tbl_OPAOINN_P1[Plan Projected Allowed Amount])","v":0},{"$f":"IF(OR(AV114=0,AV114=\"\"),\"\",AV114/tbl_OPAOINN_P2OOPM[[#Totals],[Allowed Claims]])","v":""},{"$f":"IF(AW114=\"\",\"\",IF(SUMIF(tbl_OPAOINN_P2OOPM[OOPM],\">=\"&AU114,tbl_OPAOINN_P2OOPM[Portion])>0.5,AU114,\"\"))","v":""},{"$f":"IF(COUNTIF(tbl_OPAOINN_P2OOPM[OOPM],tbl_OPAOINN_P2OOPM[[#This Row],[OOPM]])>1,\"Remove Duplicate Entry.\",IF(AND(tbl_OPAOINN_P2OOPM[[#This Row],[OOPM]]<>\"\",tbl_OPAOINN_P2OOPM[[#This Row],[Allowed Claims]]=0),\"Entry not found in Part 1 Table\",IF(AND(OFFSET(tbl_OPAOINN_P2OOPM[[#This Row],[OOPM]],1,0)<>\"Total\",OFFSET(tbl_OPAOINN_P2OOPM[[#This Row],[OOPM]],1,0)<>\"\",OFFSET(tbl_OPAOINN_P2OOPM[[#This Row],[OOPM]],1,0)<tbl_OPAOINN_P2OOPM[[#This Row],[OOPM]]),\"Sort Entries from lowest to highest\",\"\")))","v":""},null,null,null,null,null,{"$f":"SUMIF(tbl_OPOON_P1[Out-of-Pocket Maximum (OOPM)],BD114,tbl_OPOON_P1[Plan Projected Allowed Amount])","v":0},{"$f":"IF(OR(BE114=0,BE114=\"\"),\"\",BE114/tbl_OPOON_P2OOPM[[#Totals],[Allowed Claims]])","v":""},{"$f":"IF(BF114=\"\",\"\",IF(SUMIF(tbl_OPOON_P2OOPM[OOPM],\">=\"&BD114,tbl_OPOON_P2OOPM[Portion])>0.5,BD114,\"\"))","v":""},{"$f":"IF(COUNTIF(tbl_OPOON_P2OOPM[OOPM],tbl_OPOON_P2OOPM[[#This Row],[OOPM]])>1,\"Remove Duplicate Entry.\",IF(AND(tbl_OPOON_P2OOPM[[#This Row],[OOPM]]<>\"\",tbl_OPOON_P2OOPM[[#This Row],[Allowed Claims]]=0),\"Entry not found in Part 1 Table\",IF(AND(OFFSET(tbl_OPOON_P2OOPM[[#This Row],[OOPM]],1,0)<>\"Total\",OFFSET(tbl_OPOON_P2OOPM[[#This Row],[OOPM]],1,0)<>\"\",OFFSET(tbl_OPOON_P2OOPM[[#This Row],[OOPM]],1,0)<tbl_OPOON_P2OOPM[[#This Row],[OOPM]]),\"Sort Entries from lowest to highest\",\"\")))","v":""},null,null,null,null,null,{"$f":"SUMIF(tbl_OPOVOON_P1[Out-of-Pocket Maximum (OOPM)],BM114,tbl_OPOVOON_P1[Plan Projected Allowed Amount])","v":0},{"$f":"IF(OR(BN114=0,BN114=\"\"),\"\",BN114/tbl_OPOVOON_P2OOPM[[#Totals],[Allowed Claims]])","v":""},{"$f":"IF(BO114=\"\",\"\",IF(SUMIF(tbl_OPOVOON_P2OOPM[OOPM],\">=\"&BM114,tbl_OPOVOON_P2OOPM[Portion])>0.5,BM114,\"\"))","v":""},{"$f":"IF(COUNTIF(tbl_OPOVOON_P2OOPM[OOPM],tbl_OPOVOON_P2OOPM[[#This Row],[OOPM]])>1,\"Remove Duplicate Entry.\",IF(AND(tbl_OPOVOON_P2OOPM[[#This Row],[OOPM]]<>\"\",tbl_OPOVOON_P2OOPM[[#This Row],[Allowed Claims]]=0),\"Entry not found in Part 1 Table\",IF(AND(OFFSET(tbl_OPOVOON_P2OOPM[[#This Row],[OOPM]],1,0)<>\"Total\",OFFSET(tbl_OPOVOON_P2OOPM[[#This Row],[OOPM]],1,0)<>\"\",OFFSET(tbl_OPOVOON_P2OOPM[[#This Row],[OOPM]],1,0)<tbl_OPOVOON_P2OOPM[[#This Row],[OOPM]]),\"Sort Entries from lowest to highest\",\"\")))","v":""},null,null,null,null,null,{"$f":"SUMIF(tbl_OPAOOON_P1[Out-of-Pocket Maximum (OOPM)],BV114,tbl_OPAOOON_P1[Plan Projected Allowed Amount])","v":0},{"$f":"IF(OR(BW114=0,BW114=\"\"),\"\",BW114/tbl_OPAOOON_P2OOPM[[#Totals],[Allowed Claims]])","v":""},{"$f":"IF(BX114=\"\",\"\",IF(SUMIF(tbl_OPAOOON_P2OOPM[OOPM],\">=\"&BV114,tbl_OPAOOON_P2OOPM[Portion])>0.5,BV114,\"\"))","v":""},{"$f":"IF(COUNTIF(tbl_OPAOOON_P2OOPM[OOPM],tbl_OPAOOON_P2OOPM[[#This Row],[OOPM]])>1,\"Remove Duplicate Entry.\",IF(AND(tbl_OPAOOON_P2OOPM[[#This Row],[OOPM]]<>\"\",tbl_OPAOOON_P2OOPM[[#This Row],[Allowed Claims]]=0),\"Entry not found in Part 1 Table\",IF(AND(OFFSET(tbl_OPAOOON_P2OOPM[[#This Row],[OOPM]],1,0)<>\"Total\",OFFSET(tbl_OPAOOON_P2OOPM[[#This Row],[OOPM]],1,0)<>\"\",OFFSET(tbl_OPAOOON_P2OOPM[[#This Row],[OOPM]],1,0)<tbl_OPAOOON_P2OOPM[[#This Row],[OOPM]]),\"Sort Entries from lowest to highest\",\"\")))","v":""},null,null,null,null,null,{"$f":"SUMIF(tbl_ER_P1[Out-of-Pocket Maximum (OOPM)],CE114,tbl_ER_P1[Plan Projected Allowed Amount])","v":0},{"$f":"IF(OR(CF114=0,CF114=\"\"),\"\",CF114/tbl_ER_P2OOPM[[#Totals],[Allowed Claims]])","v":""},{"$f":"IF(CG114=\"\",\"\",IF(SUMIF(tbl_ER_P2OOPM[OOPM],\">=\"&CE114,tbl_ER_P2OOPM[Portion])>0.5,CE114,\"\"))","v":""},{"$f":"IF(COUNTIF(tbl_ER_P2OOPM[OOPM],tbl_ER_P2OOPM[[#This Row],[OOPM]])>1,\"Remove Duplicate Entry.\",IF(AND(tbl_ER_P2OOPM[[#This Row],[OOPM]]<>\"\",tbl_ER_P2OOPM[[#This Row],[Allowed Claims]]=0),\"Entry not found in Part 1 Table\",IF(AND(OFFSET(tbl_ER_P2OOPM[[#This Row],[OOPM]],1,0)<>\"Total\",OFFSET(tbl_ER_P2OOPM[[#This Row],[OOPM]],1,0)<>\"\",OFFSET(tbl_ER_P2OOPM[[#This Row],[OOPM]],1,0)<tbl_ER_P2OOPM[[#This Row],[OOPM]]),\"Sort Entries from lowest to highest\",\"\")))","v":""},null,null,null,null,null,{"$f":"SUMIF(tbl_RX_P1[Out-of-Pocket Maximum (OOPM)],CN114,tbl_RX_P1[Plan Projected Allowed Amount])","v":0},{"$f":"IF(OR(CO114=0,CO114=\"\"),\"\",CO114/tbl_RX_P2OOPM[[#Totals],[Allowed Claims]])","v":""},{"$f":"IF(CP114=\"\",\"\",IF(SUMIF(tbl_RX_P2OOPM[OOPM],\">=\"&CN114,tbl_RX_P2OOPM[Portion])>0.5,CN114,\"\"))","v":""},{"$f":"IF(COUNTIF(tbl_RX_P2OOPM[OOPM],tbl_RX_P2OOPM[[#This Row],[OOPM]])>1,\"Remove Duplicate Entry.\",IF(AND(tbl_RX_P2OOPM[[#This Row],[OOPM]]<>\"\",tbl_RX_P2OOPM[[#This Row],[Allowed Claims]]=0),\"Entry not found in Part 1 Table\",IF(AND(OFFSET(tbl_RX_P2OOPM[[#This Row],[OOPM]],1,0)<>\"Total\",OFFSET(tbl_RX_P2OOPM[[#This Row],[OOPM]],1,0)<>\"\",OFFSET(tbl_RX_P2OOPM[[#This Row],[OOPM]],1,0)<tbl_RX_P2OOPM[[#This Row],[OOPM]]),\"Sort Entries from lowest to highest\",\"\")))","v":""}]
[null,null,null,null,null,null,null,null,null,null,null,{"$f":"SUMIF(tbl_IPINN_P1[Out-of-Pocket Maximum (OOPM)],K115,tbl_IPINN_P1[Plan Projected Allowed Amount])","v":0},{"$f":"IF(OR(L115=0,L115=\"\"),\"\",L115/tbl_IPINN_P2OOPM[[#Totals],[Allowed Claims]])","v":""},{"$f":"IF(M115=\"\",\"\",IF(SUMIF(tbl_IPINN_P2OOPM[OOPM],\">=\"&K115,tbl_IPINN_P2OOPM[Portion])>0.5,K115,\"\"))","v":""},{"$f":"IF(COUNTIF(tbl_IPINN_P2OOPM[OOPM],tbl_IPINN_P2OOPM[[#This Row],[OOPM]])>1,\"Remove Duplicate Entry.\",IF(AND(tbl_IPINN_P2OOPM[[#This Row],[OOPM]]<>\"\",tbl_IPINN_P2OOPM[[#This Row],[Allowed Claims]]=0),\"Entry not found in Part 1 Table\",IF(AND(OFFSET(tbl_IPINN_P2OOPM[[#This Row],[OOPM]],1,0)<>\"Total\",OFFSET(tbl_IPINN_P2OOPM[[#This Row],[OOPM]],1,0)<>\"\",OFFSET(tbl_IPINN_P2OOPM[[#This Row],[OOPM]],1,0)<tbl_IPINN_P2OOPM[[#This Row],[OOPM]]),\"Sort Entries from lowest to highest\",\"\")))","v":""},null,null,null,null,null,{"$f":"SUMIF(tbl_IPOON_P1[Out-of-Pocket Maximum (OOPM)],T115,tbl_IPOON_P1[Plan Projected Allowed Amount])","v":0},{"$f":"IF(OR(U115=0,U115=\"\"),\"\",U115/tbl_IPOON_P2OOPM[[#Totals],[Allowed Claims]])","v":""},{"$f":"IF(V115=\"\",\"\",IF(SUMIF(tbl_IPOON_P2OOPM[OOPM],\">=\"&T115,tbl_IPOON_P2OOPM[Portion])>0.5,T115,\"\"))","v":""},{"$f":"IF(COUNTIF(tbl_IPOON_P2OOPM[OOPM],tbl_IPOON_P2OOPM[[#This Row],[OOPM]])>1,\"Remove Duplicate Entry.\",IF(AND(tbl_IPOON_P2OOPM[[#This Row],[OOPM]]<>\"\",tbl_IPOON_P2OOPM[[#This Row],[Allowed Claims]]=0),\"Entry not found in Part 1 Table\",IF(AND(OFFSET(tbl_IPOON_P2OOPM[[#This Row],[OOPM]],1,0)<>\"Total\",OFFSET(tbl_IPOON_P2OOPM[[#This Row],[OOPM]],1,0)<>\"\",OFFSET(tbl_IPOON_P2OOPM[[#This Row],[OOPM]],1,0)<tbl_IPOON_P2OOPM[[#This Row],[OOPM]]),\"Sort Entries from lowest to highest\",\"\")))","v":""},null,null,null,null,null,{"$f":"SUMIF(tbl_OPINN_P1[Out-of-Pocket Maximum (OOPM)],AC115,tbl_OPINN_P1[Plan Projected Allowed Amount])","v":0},{"$f":"IF(OR(AD115=0,AD115=\"\"),\"\",AD115/tbl_OPINN_P2OOPM[[#Totals],[Allowed Claims]])","v":""},{"$f":"IF(AE115=\"\",\"\",IF(SUMIF(tbl_OPINN_P2OOPM[OOPM],\">=\"&AC115,tbl_OPINN_P2OOPM[Portion])>0.5,AC115,\"\"))","v":""},{"$f":"IF(COUNTIF(tbl_OPINN_P2OOPM[OOPM],tbl_OPINN_P2OOPM[[#This Row],[OOPM]])>1,\"Remove Duplicate Entry.\",IF(AND(tbl_OPINN_P2OOPM[[#This Row],[OOPM]]<>\"\",tbl_OPINN_P2OOPM[[#This Row],[Allowed Claims]]=0),\"Entry not found in Part 1 Table\",IF(AND(OFFSET(tbl_OPINN_P2OOPM[[#This Row],[OOPM]],1,0)<>\"Total\",OFFSET(tbl_OPINN_P2OOPM[[#This Row],[OOPM]],1,0)<>\"\",OFFSET(tbl_OPINN_P2OOPM[[#This Row],[OOPM]],1,0)<tbl_OPINN_P2OOPM[[#This Row],[OOPM]]),\"Sort Entries from lowest to highest\",\"\")))","v":""},null,null,null,null,null,{"$f":"SUMIF(tbl_OPOVINN_P1[Out-of-Pocket Maximum (OOPM)],AL115,tbl_OPOVINN_P1[Plan Projected Allowed Amount])","v":0},{"$f":"IF(OR(AM115=0,AM115=\"\"),\"\",AM115/tbl_OPOVINN_P2OOPM[[#Totals],[Allowed Claims]])","v":""},{"$f":"IF(AN115=\"\",\"\",IF(SUMIF(tbl_OPOVINN_P2OOPM[OOPM],\">=\"&AL115,tbl_OPOVINN_P2OOPM[Portion])>0.5,AL115,\"\"))","v":""},{"$f":"IF(COUNTIF(tbl_OPOVINN_P2OOPM[OOPM],tbl_OPOVINN_P2OOPM[[#This Row],[OOPM]])>1,\"Remove Duplicate Entry.\",IF(AND(tbl_OPOVINN_P2OOPM[[#This Row],[OOPM]]<>\"\",tbl_OPOVINN_P2OOPM[[#This Row],[Allowed Claims]]=0),\"Entry not found in Part 1 Table\",IF(AND(OFFSET(tbl_OPOVINN_P2OOPM[[#This Row],[OOPM]],1,0)<>\"Total\",OFFSET(tbl_OPOVINN_P2OOPM[[#This Row],[OOPM]],1,0)<>\"\",OFFSET(tbl_OPOVINN_P2OOPM[[#This Row],[OOPM]],1,0)<tbl_OPOVINN_P2OOPM[[#This Row],[OOPM]]),\"Sort Entries from lowest to highest\",\"\")))","v":""},null,null,null,null,null,{"$f":"SUMIF(tbl_OPAOINN_P1[Out-of-Pocket Maximum (OOPM)],AU115,tbl_OPAOINN_P1[Plan Projected Allowed Amount])","v":0},{"$f":"IF(OR(AV115=0,AV115=\"\"),\"\",AV115/tbl_OPAOINN_P2OOPM[[#Totals],[Allowed Claims]])","v":""},{"$f":"IF(AW115=\"\",\"\",IF(SUMIF(tbl_OPAOINN_P2OOPM[OOPM],\">=\"&AU115,tbl_OPAOINN_P2OOPM[Portion])>0.5,AU115,\"\"))","v":""},{"$f":"IF(COUNTIF(tbl_OPAOINN_P2OOPM[OOPM],tbl_OPAOINN_P2OOPM[[#This Row],[OOPM]])>1,\"Remove Duplicate Entry.\",IF(AND(tbl_OPAOINN_P2OOPM[[#This Row],[OOPM]]<>\"\",tbl_OPAOINN_P2OOPM[[#This Row],[Allowed Claims]]=0),\"Entry not found in Part 1 Table\",IF(AND(OFFSET(tbl_OPAOINN_P2OOPM[[#This Row],[OOPM]],1,0)<>\"Total\",OFFSET(tbl_OPAOINN_P2OOPM[[#This Row],[OOPM]],1,0)<>\"\",OFFSET(tbl_OPAOINN_P2OOPM[[#This Row],[OOPM]],1,0)<tbl_OPAOINN_P2OOPM[[#This Row],[OOPM]]),\"Sort Entries from lowest to highest\",\"\")))","v":""},null,null,null,null,null,{"$f":"SUMIF(tbl_OPOON_P1[Out-of-Pocket Maximum (OOPM)],BD115,tbl_OPOON_P1[Plan Projected Allowed Amount])","v":0},{"$f":"IF(OR(BE115=0,BE115=\"\"),\"\",BE115/tbl_OPOON_P2OOPM[[#Totals],[Allowed Claims]])","v":""},{"$f":"IF(BF115=\"\",\"\",IF(SUMIF(tbl_OPOON_P2OOPM[OOPM],\">=\"&BD115,tbl_OPOON_P2OOPM[Portion])>0.5,BD115,\"\"))","v":""},{"$f":"IF(COUNTIF(tbl_OPOON_P2OOPM[OOPM],tbl_OPOON_P2OOPM[[#This Row],[OOPM]])>1,\"Remove Duplicate Entry.\",IF(AND(tbl_OPOON_P2OOPM[[#This Row],[OOPM]]<>\"\",tbl_OPOON_P2OOPM[[#This Row],[Allowed Claims]]=0),\"Entry not found in Part 1 Table\",IF(AND(OFFSET(tbl_OPOON_P2OOPM[[#This Row],[OOPM]],1,0)<>\"Total\",OFFSET(tbl_OPOON_P2OOPM[[#This Row],[OOPM]],1,0)<>\"\",OFFSET(tbl_OPOON_P2OOPM[[#This Row],[OOPM]],1,0)<tbl_OPOON_P2OOPM[[#This Row],[OOPM]]),\"Sort Entries from lowest to highest\",\"\")))","v":""},null,null,null,null,null,{"$f":"SUMIF(tbl_OPOVOON_P1[Out-of-Pocket Maximum (OOPM)],BM115,tbl_OPOVOON_P1[Plan Projected Allowed Amount])","v":0},{"$f":"IF(OR(BN115=0,BN115=\"\"),\"\",BN115/tbl_OPOVOON_P2OOPM[[#Totals],[Allowed Claims]])","v":""},{"$f":"IF(BO115=\"\",\"\",IF(SUMIF(tbl_OPOVOON_P2OOPM[OOPM],\">=\"&BM115,tbl_OPOVOON_P2OOPM[Portion])>0.5,BM115,\"\"))","v":""},{"$f":"IF(COUNTIF(tbl_OPOVOON_P2OOPM[OOPM],tbl_OPOVOON_P2OOPM[[#This Row],[OOPM]])>1,\"Remove Duplicate Entry.\",IF(AND(tbl_OPOVOON_P2OOPM[[#This Row],[OOPM]]<>\"\",tbl_OPOVOON_P2OOPM[[#This Row],[Allowed Claims]]=0),\"Entry not found in Part 1 Table\",IF(AND(OFFSET(tbl_OPOVOON_P2OOPM[[#This Row],[OOPM]],1,0)<>\"Total\",OFFSET(tbl_OPOVOON_P2OOPM[[#This Row],[OOPM]],1,0)<>\"\",OFFSET(tbl_OPOVOON_P2OOPM[[#This Row],[OOPM]],1,0)<tbl_OPOVOON_P2OOPM[[#This Row],[OOPM]]),\"Sort Entries from lowest to highest\",\"\")))","v":""},null,null,null,null,null,{"$f":"SUMIF(tbl_OPAOOON_P1[Out-of-Pocket Maximum (OOPM)],BV115,tbl_OPAOOON_P1[Plan Projected Allowed Amount])","v":0},{"$f":"IF(OR(BW115=0,BW115=\"\"),\"\",BW115/tbl_OPAOOON_P2OOPM[[#Totals],[Allowed Claims]])","v":""},{"$f":"IF(BX115=\"\",\"\",IF(SUMIF(tbl_OPAOOON_P2OOPM[OOPM],\">=\"&BV115,tbl_OPAOOON_P2OOPM[Portion])>0.5,BV115,\"\"))","v":""},{"$f":"IF(COUNTIF(tbl_OPAOOON_P2OOPM[OOPM],tbl_OPAOOON_P2OOPM[[#This Row],[OOPM]])>1,\"Remove Duplicate Entry.\",IF(AND(tbl_OPAOOON_P2OOPM[[#This Row],[OOPM]]<>\"\",tbl_OPAOOON_P2OOPM[[#This Row],[Allowed Claims]]=0),\"Entry not found in Part 1 Table\",IF(AND(OFFSET(tbl_OPAOOON_P2OOPM[[#This Row],[OOPM]],1,0)<>\"Total\",OFFSET(tbl_OPAOOON_P2OOPM[[#This Row],[OOPM]],1,0)<>\"\",OFFSET(tbl_OPAOOON_P2OOPM[[#This Row],[OOPM]],1,0)<tbl_OPAOOON_P2OOPM[[#This Row],[OOPM]]),\"Sort Entries from lowest to highest\",\"\")))","v":""},null,null,null,null,null,{"$f":"SUMIF(tbl_ER_P1[Out-of-Pocket Maximum (OOPM)],CE115,tbl_ER_P1[Plan Projected Allowed Amount])","v":0},{"$f":"IF(OR(CF115=0,CF115=\"\"),\"\",CF115/tbl_ER_P2OOPM[[#Totals],[Allowed Claims]])","v":""},{"$f":"IF(CG115=\"\",\"\",IF(SUMIF(tbl_ER_P2OOPM[OOPM],\">=\"&CE115,tbl_ER_P2OOPM[Portion])>0.5,CE115,\"\"))","v":""},{"$f":"IF(COUNTIF(tbl_ER_P2OOPM[OOPM],tbl_ER_P2OOPM[[#This Row],[OOPM]])>1,\"Remove Duplicate Entry.\",IF(AND(tbl_ER_P2OOPM[[#This Row],[OOPM]]<>\"\",tbl_ER_P2OOPM[[#This Row],[Allowed Claims]]=0),\"Entry not found in Part 1 Table\",IF(AND(OFFSET(tbl_ER_P2OOPM[[#This Row],[OOPM]],1,0)<>\"Total\",OFFSET(tbl_ER_P2OOPM[[#This Row],[OOPM]],1,0)<>\"\",OFFSET(tbl_ER_P2OOPM[[#This Row],[OOPM]],1,0)<tbl_ER_P2OOPM[[#This Row],[OOPM]]),\"Sort Entries from lowest to highest\",\"\")))","v":""},null,null,null,null,null,{"$f":"SUMIF(tbl_RX_P1[Out-of-Pocket Maximum (OOPM)],CN115,tbl_RX_P1[Plan Projected Allowed Amount])","v":0},{"$f":"IF(OR(CO115=0,CO115=\"\"),\"\",CO115/tbl_RX_P2OOPM[[#Totals],[Allowed Claims]])","v":""},{"$f":"IF(CP115=\"\",\"\",IF(SUMIF(tbl_RX_P2OOPM[OOPM],\">=\"&CN115,tbl_RX_P2OOPM[Portion])>0.5,CN115,\"\"))","v":""},{"$f":"IF(COUNTIF(tbl_RX_P2OOPM[OOPM],tbl_RX_P2OOPM[[#This Row],[OOPM]])>1,\"Remove Duplicate Entry.\",IF(AND(tbl_RX_P2OOPM[[#This Row],[OOPM]]<>\"\",tbl_RX_P2OOPM[[#This Row],[Allowed Claims]]=0),\"Entry not found in Part 1 Table\",IF(AND(OFFSET(tbl_RX_P2OOPM[[#This Row],[OOPM]],1,0)<>\"Total\",OFFSET(tbl_RX_P2OOPM[[#This Row],[OOPM]],1,0)<>\"\",OFFSET(tbl_RX_P2OOPM[[#This Row],[OOPM]],1,0)<tbl_RX_P2OOPM[[#This Row],[OOPM]]),\"Sort Entries from lowest to highest\",\"\")))","v":""}]
[null,null,null,null,null,null,null,null,null,null,"Total",{"$f":"SUBTOTAL(109,tbl_IPINN_P2OOPM[Allowed Claims])","v":0},{"$f":"SUBTOTAL(109,tbl_IPINN_P2OOPM[Portion])","v":0},null,{"$f":"IF(AND(tbl_IPINN_P2OOPM[[#Totals],[Allowed Claims]]<L72,N72<>\"Fail\",N72<>\"N/A\"),\"Add missing cost share values.\",IF(L116>M55,\"Allowed claims higher than possible; correct entries.\",\"\"))","v":""},null,null,null,null,"Total",{"$f":"SUBTOTAL(109,tbl_IPOON_P2OOPM[Allowed Claims])","v":0},{"$f":"SUBTOTAL(109,tbl_IPOON_P2OOPM[Portion])","v":0},null,{"$f":"IF(AND(tbl_IPOON_P2OOPM[[#Totals],[Allowed Claims]]<U72,W72<>\"Fail\",W72<>\"N/A\"),\"Add missing cost share values.\",IF(U116>V55,\"Allowed claims higher than possible; correct entries.\",\"\"))","v":""},null,null,null,null,"Total",{"$f":"SUBTOTAL(109,tbl_OPINN_P2OOPM[Allowed Claims])","v":0},{"$f":"SUBTOTAL(109,tbl_OPINN_P2OOPM[Portion])","v":0},null,{"$f":"IF(AND(tbl_OPINN_P2OOPM[[#Totals],[Allowed Claims]]<AD72,AF72<>\"Fail\",AF72<>\"N/A\"),\"Add missing cost share values.\",IF(AD116>AE55,\"Allowed claims higher than possible; correct entries.\",\"\"))","v":""},null,null,null,null,"Total",{"$f":"SUBTOTAL(109,tbl_OPOVINN_P2OOPM[Allowed Claims])","v":0},{"$f":"SUBTOTAL(109,tbl_OPOVINN_P2OOPM[Portion])","v":0},null,{"$f":"IF(AND(tbl_OPOVINN_P2OOPM[[#Totals],[Allowed Claims]]<AM72,AO72<>\"Fail\",AO72<>\"N/A\"),\"Add missing cost share values.\",IF(AM116>AN55,\"Allowed claims higher than possible; correct entries.\",\"\"))","v":""},null,null,null,null,"Total",{"$f":"SUBTOTAL(109,tbl_OPAOINN_P2OOPM[Allowed Claims])","v":0},{"$f":"SUBTOTAL(109,tbl_OPAOINN_P2OOPM[Portion])","v":0},null,{"$f":"IF(AND(tbl_OPAOINN_P2OOPM[[#Totals],[Allowed Claims]]<AV72,AX72<>\"Fail\",AX72<>\"N/A\"),\"Add missing cost share values.\",IF(AV116>AW55,\"Allowed claims higher than possible; correct entries.\",\"\"))","v":""},null,null,null,null,"Total",{"$f":"SUBTOTAL(109,tbl_OPOON_P2OOPM[Allowed Claims])","v":0},{"$f":"SUBTOTAL(109,tbl_OPOON_P2OOPM[Portion])","v":0},null,{"$f":"IF(AND(tbl_OPOON_P2OOPM[[#Totals],[Allowed Claims]]<BE72,BG72<>\"Fail\",BG72<>\"N/A\"),\"Add missing cost share values.\",IF(BE116>BF55,\"Allowed claims higher than possible; correct entries.\",\"\"))","v":""},null,null,null,null,"Total",{"$f":"SUBTOTAL(109,tbl_OPOVOON_P2OOPM[Allowed Claims])","v":0},{"$f":"SUBTOTAL(109,tbl_OPOVOON_P2OOPM[Portion])","v":0},null,{"$f":"IF(AND(tbl_OPOVOON_P2OOPM[[#Totals],[Allowed Claims]]<BN72,BP72<>\"Fail\",BP72<>\"N/A\"),\"Add missing cost share values.\",IF(BN116>BO55,\"Allowed claims higher than possible; correct entries.\",\"\"))","v":""},null,null,null,null,"Total",{"$f":"SUBTOTAL(109,tbl_OPAOOON_P2OOPM[Allowed Claims])","v":0},{"$f":"SUBTOTAL(109,tbl_OPAOOON_P2OOPM[Portion])","v":0},null,{"$f":"IF(AND(tbl_OPAOOON_P2OOPM[[#Totals],[Allowed Claims]]<BW72,BY72<>\"Fail\",BY72<>\"N/A\"),\"Add missing cost share values.\",IF(BW116>BX55,\"Allowed claims higher than possible; correct entries.\",\"\"))","v":""},null,null,null,null,"Total",{"$f":"SUBTOTAL(109,tbl_ER_P2OOPM[Allowed Claims])","v":0},{"$f":"SUBTOTAL(109,tbl_ER_P2OOPM[Portion])","v":0},null,{"$f":"IF(AND(tbl_ER_P2OOPM[[#Totals],[Allowed Claims]]<CF72,CH72<>\"Fail\",CH72<>\"N/A\"),\"Add missing cost share values.\",IF(CF116>CG55,\"Allowed claims higher than possible; correct entries.\",\"\"))","v":""},null,null,null,null,"Total",{"$f":"SUBTOTAL(109,tbl_RX_P2OOPM[Allowed Claims])","v":0},{"$f":"SUBTOTAL(109,tbl_RX_P2OOPM[Portion])","v":0},null,{"$f":"IF(AND(tbl_RX_P2OOPM[[#Totals],[Allowed Claims]]<CO72,CQ72<>\"Fail\",CQ72<>\"N/A\"),\"Add missing cost share values.\",IF(CO116>CP55,\"Allowed claims higher than possible; correct entries.\",\"\"))","v":""}]

{"sheet":"Developer Notes","index":5,"n_rows":2,"n_cols":2,"rows_kept":2,"cut":false,"hidden":true,"merged":[]}
["Development Notes"]
[45391,"Do not use table references in Part 2 Table total rows, there is a bug in Excel where the formula will change after data is entered in the first column. The table reference will change to pointing to the original template sheet rather than the template copy sheet."]

{"sheet":"LookupTables","index":6,"n_rows":35,"n_cols":11,"rows_kept":35,"cut":false,"hidden":true,"merged":[]}
["Workbook Lookup Tables"]
[]
["Market",null,"Network","Code",null,"Benefit Classification","Classification Code",null,"Yes/No Cells",null,"OutpatientToggle"]
["Select a Market",null,"In-Network","INN",null,"Inpatient","IP",null,"Select Input",null,"Select Input"]
["Individual",null,"Out-of-Network","OON",null,"Outpatient","OP",null,"Yes",null,"All Combined"]
["Small Group",null,"N/A",{"$f":"\"\"","v":""},null,"Outpatient - Office Visits","OP-OV",null,"No",null,"Office Visits Separate"]
[null,null,null,null,null,"Outpatient - All Other","OP-AO"]
[null,null,null,null,null,"Emergency Care","ER"]
[null,null,null,null,null,"Prescription Drugs","RX"]
[]
[]
[]
[null,null,null,null,null,"<<select testing classification>>",null,"<<select mapped Ben. Comp. category>>"]
[null,null,null,null,null,"Inpatient",null,"Emergency Room Services"]
[null,null,null,null,null,"Outpatient",null,"Inpatient Hospital Services (e.g., Hospital Stay)"]
[null,null,null,null,null,"Outpatient - Office Visits",null,"Primary Care Visit to Treat an Injury or Illness"]
[null,null,null,null,null,"Outpatient - All Other",null,"Specialist Visit"]
[null,null,null,null,null,"Emergency Care",null,"Mental Health & Substance Use Disorder Office Visits"]
[null,null,null,null,null,"Prescription Drugs",null,"Mental Health & Substance Use Disorder All Other OP Services"]
[null,null,null,null,null,"Outpatient",null,"Imaging (CT/PET Scans, MRIs)"]
[null,null,null,null,null,null,null,"Rehabilitative Speech Therapy"]
[null,null,null,null,null,null,null,"Rehabilitative Occupational and Rehabilitative Physical Therapy"]
[null,null,null,null,null,null,null,"Preventive Care/Screening/Immunization"]
[null,null,null,null,null,null,null,"Laboratory Outpatient and Professional Services"]
[null,null,null,null,null,null,null,"X-rays and Diagnostic Imaging"]
[null,null,null,null,null,null,null,"Skilled Nursing Facility"]
[null,null,null,null,null,null,null,"Outpatient Facility Fee (e.g., Ambulatory Surgery Center)"]
[null,null,null,null,null,null,null,"Outpatient Surgery Physician/Surgical Services"]
[null,null,null,null,null,null,null,"Urgent Care"]
[null,null,null,null,null,null,null,"Emergency Transportation"]
[null,null,null,null,null,null,null,"Generic Drugs (Tier 1)"]
[null,null,null,null,null,null,null,"Preferred Brand Drugs (Tier 2)"]
[null,null,null,null,null,null,null,"Non-Preferred Brand Drugs (Tier 3)"]
[null,null,null,null,null,null,null,"Specialty Drugs (Tier 4)"]
[null,null,null,null,null,null,"Delete here >>>>>"]

{"sheet":"Example","index":7,"n_rows":119,"n_cols":99,"rows_kept":119,"cut":false,"hidden":false,"merged":[[13,91,13,95],[18,1,19,1],[18,2,19,2],[18,6,19,6],[13,4,13,8],[13,10,13,14],[13,19,13,23],[13,28,13,32],[13,37,13,41],[13,46,13,50],[25,8,26,8],[13,55,13,59],[13,64,13,68],[13,73,13,77],[13,82,13,86],[25,1,26,1],[25,2,26,2],[25,3,26,3],[25,4,26,4],[25,5,26,5],[62,69,62,71],[62,78,62,80],[62,87,62,89],[62,96,62,98],[63,15,66,17],[63,24,66,26],[63,33,66,35],[63,42,66,44],[63,51,66,53],[63,60,66,62],[62,15,62,17],[62,24,62,26],[62,33,62,35],[62,42,62,44],[62,51,62,53],[62,60,62,62],[63,69,66,71],[63,78,66,80],[63,87,66,89],[63,96,66,98],[78,10,80,14],[78,19,80,23],[78,28,80,32],[78,37,80,41],[78,46,80,50],[78,55,80,59],[78,64,80,68],[78,73,80,77],[78,82,80,86],[78,91,80,95],[87,55,88,59],[87,73,88,77],[87,82,88,86],[87,91,88,95],[99,10,101,14],[98,19,100,23],[98,28,100,32],[98,37,100,41],[98,46,100,50],[98,55,100,59],[88,10,90,14],[87,28,89,32],[87,37,89,41],[87,46,89,50],[87,19,89,23],[109,64,111,68],[109,73,111,77],[109,82,111,86],[109,91,111,95],[8,6,11,8],[98,64,100,68],[98,73,100,77],[98,82,100,86],[98,91,100,95],[110,10,112,14],[109,19,111,23],[109,28,111,32],[109,37,111,41],[109,46,111,50],[109,55,111,59],[87,64,88,68]]}
["MHSUD Financial Requirement (a.k.a. Cost Share) Parity Testing",null,null,null,null,null,"Workbook Info",null,null,null,{"$f":"K40","v":"Benefit Classification"},{"$f":"L40","v":"(1) Inpatient, In-Network (IP INN)"},null,null,null,null,null,null,null,{"$f":"T40","v":"Benefit Classification"},{"$f":"U40","v":"(2) Inpatient, Out-of-Network (IP OON)"},null,null,null,null,null,null,null,{"$f":"AC40","v":"Benefit Classification"},{"$f":"AD40","v":"(3) Outpatient, In-Network (OP INN)"},null,null,null,null,null,null,null,{"$f":"AL40","v":"Benefit Classification"},{"$f":"AM40","v":"(3a) Outpatient - Office Visits, In-Network (OP-OV INN)"},null,null,null,null,null,null,null,{"$f":"AU40","v":"Benefit Classification"},{"$f":"AV40","v":"(3b) Outpatient - All Other, In-Network (OP-AO INN)"},null,null,null,null,null,null,null,{"$f":"BD40","v":"Benefit Classification"},{"$f":"BE40","v":"(4) Outpatient, Out-of-Network (OP OON)"},null,null,null,null,null,null,null,{"$f":"BM40","v":"Benefit Classification"},{"$f":"BN40","v":"(4a) Outpatient - Office Visits, Out-of-Network (OP-OV OON)"},null,null,null,null,null,null,null,{"$f":"BV40","v":"Benefit Classification"},{"$f":"BW40","v":"(4b) Outpatient - All Other, Out-of-Network (OP-AO OON)"},null,null,null,null,null,null,null,{"$f":"CE40","v":"Benefit Classification"},{"$f":"CF40","v":"(5) Emergency Care,  (ER )"},null,null,null,null,null,null,null,{"$f":"CN40","v":"Benefit Classification"},{"$f":"CO40","v":"(6) Prescription Drugs,  (RX )"}]
[]
[null,"Issuer / Market:",{"$f":"IF(LEFT(IssuerName,2)=\"<<\",\"<<Go back to 'Summary' tab and enter Issuer Name>>\",IssuerName)","v":"<<Go back to 'Summary' tab and enter Issuer Name>>"},null,null,null,"Link back to Summary Sheet"]
[null,"Market:",{"$f":"IF(Market=\"Select Market\",\"<<Go back to 'Summary' tab and select the market for this filing>>\",Market)","v":"<<Go back to 'Summary' tab and select the market for this filing>>"},null,null,null,"User Inputs Cell Format"]
[null,"State Filing Tracking Number:",{"$f":"IF(LEFT(StateTracker,2)=\"<<\",\"<<Go back to 'Summary' tab and enter state filing tracking number>>\",StateTracker)","v":"<<Go back to 'Summary' tab and enter state filing tracking number>>"},null,null,null,"See the Example worksheet for additional details."]
[]
["PLAN INFORMATION"]
[]
[null,"Plan Name:",null,"<<<<This will auto populate from summary sheet macro",null,null,"FOR DEMONSTRATION PURPOSES ONLY"]
[null,"Plan ID:",null,"<<<<This will auto populate from summary sheet macro"]
[null,"CSR Variant Description:",null,"<<<<If the plan is a CSR variant, identify it here. Otherwise, leave the field blank.",null,null,null,null,null,null,"Click>>>>>","Home",null,"Errors found:",{"$f":"O78+O88+O99+O110","v":11},null,null,null,null,"Click>>>>>","Home",null,"Errors found:",{"$f":"X78+X87+X98+X109","v":0},null,null,null,null,"Click>>>>>","Home",null,"Errors found:",{"$f":"AG78+AG87+AG98+AG109","v":0},null,null,null,null,"Click>>>>>","Home",null,"Errors found:",{"$f":"AP78+AP87+AP98+AP109","v":0},null,null,null,null,"Click>>>>>","Home",null,"Errors found:",{"$f":"AY78+AY87+AY98+AY109","v":0},null,null,null,null,"Click>>>>>","Home",null,"Errors found:",{"$f":"BH78+BH87+BH98+BH109","v":0},null,null,null,null,"Click>>>>>","Home",null,"Errors found:",{"$f":"BQ78+BQ87+BQ98+BQ109","v":0},null,null,null,null,"Click>>>>>","Home",null,"Errors found:",{"$f":"BZ78+BZ87+BZ98+BZ109","v":0},null,null,null,null,"Click>>>>>","Home",null,"Errors found:",{"$f":"CI78+CI87+CI98+CI109","v":0},null,null,null,null,"Click>>>>>","Home",null,"Errors found:",{"$f":"CR78+CR87+CR98+CR109","v":0}]
["PARITY PASS/FAIL RESULTS, BY BENEFIT CLASSIFICATION"]
[]
[null,"Overall Result:",{"$f":"IF(AND(I28=\"Pass\",OR(I30=\"Pass\",AND(I32=\"Pass\",I33=\"Pass\")),E36=\"Pass\",E37=\"Pass\"),\"Pass\",\"Fail\")","v":"Fail"},null,"<<<<Click the links in the cells below to scroll directly to the stated section>>>>>",null,null,null,null,null,"<<<<Click the links in the cells below to scroll directly to the stated section>>>>>",null,null,null,null,null,null,null,null,"<<<<Click the links in the cells below to scroll directly to the stated section>>>>>",null,null,null,null,null,null,null,null,"<<<<Click the links in the cells below to scroll directly to the stated section>>>>>",null,null,null,null,null,null,null,null,"<<<<Click the links in the cells below to scroll directly to the stated section>>>>>",null,null,null,null,null,null,null,null,"<<<<Click the links in the cells below to scroll directly to the stated section>>>>>",null,null,null,null,null,null,null,null,"<<<<Click the links in the cells below to scroll directly to the stated section>>>>>",null,null,null,null,null,null,null,null,"<<<<Click the links in the cells below to scroll directly to the stated section>>>>>",null,null,null,null,null,null,null,null,"<<<<Click the links in the cells below to scroll directly to the stated section>>>>>",null,null,null,null,null,null,null,null,"<<<<Click the links in the cells below to scroll directly to the stated section>>>>>",null,null,null,null,null,null,null,null,"<<<<Click the links in the cells below to scroll directly to the stated section>>>>>"]
[null,null,null,null,"Move to IP INN","Move to IP OON","Move to OP INN","Move to OP-OV INN","Move to OP-AO INN",null,"Move to IP INN","Move to IP OON","Move to OP INN","Move to OP-OV INN","Move to OP-AO INN",null,null,null,null,"Move to IP INN","Move to IP OON","Move to OP INN","Move to OP-OV INN","Move to OP-AO INN",null,null,null,null,"Move to IP INN","Move to IP OON","Move to OP INN","Move to OP-OV INN","Move to OP-AO INN",null,null,null,null,"Move to IP INN","Move to IP OON","Move to OP INN","Move to OP-OV INN","Move to OP-AO INN",null,null,null,null,"Move to IP INN","Move to IP OON","Move to OP INN","Move to OP-OV INN","Move to OP-AO INN",null,null,null,null,"Move to IP INN","Move to IP OON","Move to OP INN","Move to OP-OV INN","Move to OP-AO INN",null,null,null,null,"Move to IP INN","Move to IP OON","Move to OP INN","Move to OP-OV INN","Move to OP-AO INN",null,null,null,null,"Move to IP INN","Move to IP OON","Move to OP INN","Move to OP-OV INN","Move to OP-AO INN",null,null,null,null,"Move to IP INN","Move to IP OON","Move to OP INN","Move to OP-OV INN","Move to OP-AO INN",null,null,null,null,"Move to IP INN","Move to IP OON","Move to OP INN","Move to OP-OV INN","Move to OP-AO INN"]
[null,null,"Links only work for sections that are not already hidden>>>>>",null,"Move to OP OON","Move to OP-OV OON","Move to OP-AO OON","Move to ER","Move to RX",null,"Move to OP OON","Move to OP-OV OON","Move to OP-AO OON","Move to ER","Move to RX",null,null,null,null,"Move to OP OON","Move to OP-OV OON","Move to OP-AO OON","Move to ER","Move to RX",null,null,null,null,"Move to OP OON","Move to OP-OV OON","Move to OP-AO OON","Move to ER","Move to RX",null,null,null,null,"Move to OP OON","Move to OP-OV OON","Move to OP-AO OON","Move to ER","Move to RX",null,null,null,null,"Move to OP OON","Move to OP-OV OON","Move to OP-AO OON","Move to ER","Move to RX",null,null,null,null,"Move to OP OON","Move to OP-OV OON","Move to OP-AO OON","Move to ER","Move to RX",null,null,null,null,"Move to OP OON","Move to OP-OV OON","Move to OP-AO OON","Move to ER","Move to RX",null,null,null,null,"Move to OP OON","Move to OP-OV OON","Move to OP-AO OON","Move to ER","Move to RX",null,null,null,null,"Move to OP OON","Move to OP-OV OON","Move to OP-AO OON","Move to ER","Move to RX",null,null,null,null,"Move to OP OON","Move to OP-OV OON","Move to OP-AO OON","Move to ER","Move to RX"]
[]
[null,"Testing Options"]
[null,"Option","Selection",null,null,null,"No Errors found?"]
[]
[null,"Out-of-Network Tier?","Yes",null,null,null,{"$f":"IF(O11+X11+AG11+AP11+AY11+BH11+BQ11+BZ11+CI11+CR11=0,TRUE,FALSE)","v":false}]
[null,"Outpatient Benefit Testing","Office Visits Separate"]
[]
[]
[null,"Results By Benefit Classification"]
[null,"A. Benefit Classification","B1. Do the MHSUD cost shares match all Medical/Surgical cost shares in the Benefit Classification? \n(In-Network)","C1. Test Required? \n(In-Network)","B2. Do the MHSUD cost shares match all Medical/Surgical cost shares in the Benefit Classification? \n(Out-of-Network)","C2. Test Required?\n (Out-of-Network)","D. By Network Tier",null,"E. Test Results"]
[null,null,null,null,null,null,"D1.\nIn-Network","D2. \nOut-of-Network"]
[null,"Inpatient","No",{"$f":"IF(C28=\"Yes\",\"No\",\"Yes\")","v":"Yes"},"No",{"$f":"IF(E28=\"Yes\",\"No\",\"Yes\")","v":"Yes"},{"$f":"N68","v":"Fail"},{"$f":"IF($C$21=\"No\",\"Pass\",W68)","v":"Pass"},{"$f":"IF(AND(G28=\"Pass\",H28=\"Pass\"),\"Pass\",\"Fail\")","v":"Fail"}]
[null,"Outpatient"]
[null,"Outpatient - All Services Combined","Select Input",{"$f":"IF(C22=\"All Combined\",IF(C30=\"Yes\",\"No\",\"Yes\"),\"No\")","v":"No"},"Select Input",{"$f":"IF(C22=\"All Combined\",IF(E30=\"Yes\",\"No\",\"Yes\"),\"No\")","v":"No"},{"$f":"AF68","v":"Pass"},{"$f":"IF($C$21=\"No\",\"Pass\",BG68)","v":"Pass"},{"$f":"IF(AND(G30=\"Pass\",H30=\"Pass\"),\"Pass\",\"Fail\")","v":"Pass"}]
[null,"Outpatient - Office Visits Separate"]
[null,"Outpatient - Office Visits","Yes",{"$f":"IF(C22=\"Office Visits Separate\",IF(C32=\"Yes\",\"No\",\"Yes\"),\"No\")","v":"No"},"Yes",{"$f":"IF(C22=\"Office Visits Separate\",IF(E32=\"Yes\",\"No\",\"Yes\"),\"No\")","v":"No"},{"$f":"AO68","v":"Pass"},{"$f":"IF($C$21=\"No\",\"Pass\",BP68)","v":"Pass"},{"$f":"IF(AND(G32=\"Pass\",H32=\"Pass\"),\"Pass\",\"Fail\")","v":"Pass"}]
[null,"Outpatient - All Other","Yes",{"$f":"IF(C22=\"Office Visits Separate\",IF(C33=\"Yes\",\"No\",\"Yes\"),\"No\")","v":"No"},"Yes",{"$f":"IF(C22=\"Office Visits Separate\",IF(E33=\"Yes\",\"No\",\"Yes\"),\"No\")","v":"No"},{"$f":"AX68","v":"Pass"},{"$f":"IF($C$21=\"No\",\"Pass\",BY68)","v":"Pass"},{"$f":"IF(AND(G33=\"Pass\",H33=\"Pass\"),\"Pass\",\"Fail\")","v":"Pass"}]
[]
[null,"A. Benefit Classification","B. Do the MHSUD cost shares match all Medical/Surgical cost shares in the Benefit Classification?","C. Test Required?","D. Test Results"]
[null,"Emergency Care","Yes",{"$f":"IF(C36=\"Yes\",\"No\",\"Yes\")","v":"No"},{"$f":"IF(D36=\"No\",\"Pass\",CH68)","v":"Pass"}]
[null,"Prescription Drugs","Yes",{"$f":"IF(C37=\"Yes\",\"No\",\"Yes\")","v":"No"},{"$f":"IF(D37=\"No\",\"Pass\",CQ68)","v":"Pass"}]
[null,null,null,null,null,null,null,null,null,null,"PART 1",null,null,null,null,null,null,null,null,"PART 1",null,null,null,null,null,null,null,null,"PART 1",null,null,null,null,null,null,null,null,"PART 1",null,null,null,null,null,null,null,null,"PART 1",null,null,null,null,null,null,null,null,"PART 1",null,null,null,null,null,null,null,null,"PART 1",null,null,null,null,null,null,null,null,"PART 1",null,null,null,null,null,null,null,null,"PART 1",null,null,null,null,null,null,null,null,"PART 1"]
[null,null,null,null,null,null,null,null,null,null,"COST SHARES FOR MEDICAL/SURGICAL BENEFITS, BY BENEFIT CLASSIFICATION",null,null,null,null,null,null,null,null,"COST SHARES FOR MEDICAL/SURGICAL BENEFITS, BY BENEFIT CLASSIFICATION",null,null,null,null,null,null,null,null,"COST SHARES FOR MEDICAL/SURGICAL BENEFITS, BY BENEFIT CLASSIFICATION",null,null,null,null,null,null,null,null,"COST SHARES FOR MEDICAL/SURGICAL BENEFITS, BY BENEFIT CLASSIFICATION",null,null,null,null,null,null,null,null,"COST SHARES FOR MEDICAL/SURGICAL BENEFITS, BY BENEFIT CLASSIFICATION",null,null,null,null,null,null,null,null,"COST SHARES FOR MEDICAL/SURGICAL BENEFITS, BY BENEFIT CLASSIFICATION",null,null,null,null,null,null,null,null,"COST SHARES FOR MEDICAL/SURGICAL BENEFITS, BY BENEFIT CLASSIFICATION",null,null,null,null,null,null,null,null,"COST SHARES FOR MEDICAL/SURGICAL BENEFITS, BY BENEFIT CLASSIFICATION",null,null,null,null,null,null,null,null,"COST SHARES FOR MEDICAL/SURGICAL BENEFITS, BY BENEFIT CLASSIFICATION",null,null,null,null,null,null,null,null,"COST SHARES FOR MEDICAL/SURGICAL BENEFITS, BY BENEFIT CLASSIFICATION"]
[null,null,null,null,null,null,null,null,null,null,"Benefit Classification",{"$f":"\"(\" &L45&\") \"&L43&\", \"&SUBSTITUTE(L44,\"N/A\",\"\")&\" (\"&M45&\")\"","v":"(1) Inpatient, In-Network (IP INN)"},null,null,null,null,null,null,null,"Benefit Classification",{"$f":"\"(\" &U45&\") \"&U43&\", \"&SUBSTITUTE(U44,\"N/A\",\"\")&\" (\"&V45&\")\"","v":"(2) Inpatient, Out-of-Network (IP OON)"},null,null,null,null,null,null,null,"Benefit Classification",{"$f":"\"(\" &AD45&\") \"&AD43&\", \"&SUBSTITUTE(AD44,\"N/A\",\"\")&\" (\"&AE45&\")\"","v":"(3) Outpatient, In-Network (OP INN)"},null,null,null,null,null,null,null,"Benefit Classification",{"$f":"\"(\" &AM45&\") \"&AM43&\", \"&SUBSTITUTE(AM44,\"N/A\",\"\")&\" (\"&AN45&\")\"","v":"(3a) Outpatient - Office Visits, In-Network (OP-OV INN)"},null,null,null,null,null,null,null,"Benefit Classification",{"$f":"\"(\" &AV45&\") \"&AV43&\", \"&SUBSTITUTE(AV44,\"N/A\",\"\")&\" (\"&AW45&\")\"","v":"(3b) Outpatient - All Other, In-Network (OP-AO INN)"},null,null,null,null,null,null,null,"Benefit Classification",{"$f":"\"(\" &BE45&\") \"&BE43&\", \"&SUBSTITUTE(BE44,\"N/A\",\"\")&\" (\"&BF45&\")\"","v":"(4) Outpatient, Out-of-Network (OP OON)"},null,null,null,null,null,null,null,"Benefit Classification",{"$f":"\"(\" &BN45&\") \"&BN43&\", \"&SUBSTITUTE(BN44,\"N/A\",\"\")&\" (\"&BO45&\")\"","v":"(4a) Outpatient - Office Visits, Out-of-Network (OP-OV OON)"},null,null,null,null,null,null,null,"Benefit Classification",{"$f":"\"(\" &BW45&\") \"&BW43&\", \"&SUBSTITUTE(BW44,\"N/A\",\"\")&\" (\"&BX45&\")\"","v":"(4b) Outpatient - All Other, Out-of-Network (OP-AO OON)"},null,null,null,null,null,null,null,"Benefit Classification",{"$f":"\"(\" &CF45&\") \"&CF43&\", \"&SUBSTITUTE(CF44,\"N/A\",\"\")&\" (\"&CG45&\")\"","v":"(5) Emergency Care,  (ER )"},null,null,null,null,null,null,null,"Benefit Classification",{"$f":"\"(\" &CO45&\") \"&CO43&\", \"&SUBSTITUTE(CO44,\"N/A\",\"\")&\" (\"&CP45&\")\"","v":"(6) Prescription Drugs,  (RX )"}]
[null,null,null,null,null,null,null,null,null,null,null,null,null,null,null,null,null,null,null,null,null,null,null,null,null,null,null,null,"Notes:","Use this table if you are testing all outpatient services combined.",null,null,null,null,null,null,null,"Notes:","Use this table if you are separately testing outpatient office visits and all other outpatient services.",null,null,null,null,null,null,null,"Notes:",{"$f":"AM41","v":"Use this table if you are separately testing outpatient office visits and all other outpatient services."},null,null,null,null,null,null,null,"Notes:","Use this table if you are testing all outpatient services combined.",null,null,null,null,null,null,null,"Notes:",{"$f":"AM41","v":"Use this table if you are separately testing outpatient office visits and all other outpatient services."},null,null,null,null,null,null,null,"Notes:",{"$f":"BN41","v":"Use this table if you are separately testing outpatient office visits and all other outpatient services."}]
[]
[null,null,null,null,null,null,null,null,null,null,"Classification","Inpatient",{"$f":"VLOOKUP(L43,LookupTables!$F$4:$G$9,2,FALSE)","v":"IP"},null,null,null,null,null,null,"Classification","Inpatient",{"$f":"VLOOKUP(U43,LookupTables!$F$4:$G$9,2,FALSE)","v":"IP"},null,null,null,null,null,null,"Classification","Outpatient",{"$f":"VLOOKUP(AD43,LookupTables!$F$4:$G$9,2,FALSE)","v":"OP"},null,null,null,null,null,null,"Classification","Outpatient - Office Visits",{"$f":"VLOOKUP(AM43,LookupTables!$F$4:$G$9,2,FALSE)","v":"OP-OV"},null,null,null,null,null,null,"Classification","Outpatient - All Other",{"$f":"VLOOKUP(AV43,LookupTables!$F$4:$G$9,2,FALSE)","v":"OP-AO"},null,null,null,null,null,null,"Classification","Outpatient",{"$f":"VLOOKUP(BE43,LookupTables!$F$4:$G$9,2,FALSE)","v":"OP"},null,null,null,null,null,null,"Classification","Outpatient - Office Visits",{"$f":"VLOOKUP(BN43,LookupTables!$F$4:$G$9,2,FALSE)","v":"OP-OV"},null,null,null,null,null,null,"Classification","Outpatient - All Other",{"$f":"VLOOKUP(BW43,LookupTables!$F$4:$G$9,2,FALSE)","v":"OP-AO"},null,null,null,null,null,null,"Classification","Emergency Care",{"$f":"VLOOKUP(CF43,LookupTables!$F$4:$G$9,2,FALSE)","v":"ER"},null,null,null,null,null,null,"Classification","Prescription Drugs",{"$f":"VLOOKUP(CO43,LookupTables!$F$4:$G$9,2,FALSE)","v":"RX"}]
[null,null,null,null,null,null,null,null,null,null,"Network (In/Out)","In-Network",{"$f":"VLOOKUP(L44,LookupTables!$C$4:$D$6,2,0)","v":"INN"},null,null,null,null,null,null,"Network (In/Out)","Out-of-Network",{"$f":"VLOOKUP(U44,LookupTables!$C$4:$D$6,2,0)","v":"OON"},null,null,null,null,null,null,"Network (In/Out)","In-Network",{"$f":"VLOOKUP(AD44,LookupTables!$C$4:$D$6,2,0)","v":"INN"},null,null,null,null,null,null,"Network (In/Out)","In-Network",{"$f":"VLOOKUP(AM44,LookupTables!$C$4:$D$6,2,0)","v":"INN"},null,null,null,null,null,null,"Network (In/Out)","In-Network",{"$f":"VLOOKUP(AV44,LookupTables!$C$4:$D$6,2,0)","v":"INN"},null,null,null,null,null,null,"Network (In/Out)","Out-of-Network",{"$f":"VLOOKUP(BE44,LookupTables!$C$4:$D$6,2,0)","v":"OON"},null,null,null,null,null,null,"Network (In/Out)","Out-of-Network",{"$f":"VLOOKUP(BN44,LookupTables!$C$4:$D$6,2,0)","v":"OON"},null,null,null,null,null,null,"Network (In/Out)","Out-of-Network",{"$f":"VLOOKUP(BW44,LookupTables!$C$4:$D$6,2,0)","v":"OON"},null,null,null,null,null,null,"Network (In/Out)","N/A",{"$f":"VLOOKUP(CF44,LookupTables!$C$4:$D$6,2,0)","v":""},null,null,null,null,null,null,"Network (In/Out)","N/A",{"$f":"VLOOKUP(CO44,LookupTables!$C$4:$D$6,2,0)","v":""}]
[null,null,null,null,null,null,null,null,null,null,"Classification Code",1,{"$f":"M43&\" \"&M44","v":"IP INN"},null,null,null,"Number of Rows",6,null,"Classification Code",2,{"$f":"V43&\" \"&V44","v":"IP OON"},null,null,null,"Number of Rows","8",null,"Classification Code",3,{"$f":"AE43&\" \"&AE44","v":"OP INN"},null,null,null,"Number of Rows","6",null,"Classification Code","3a",{"$f":"AN43&\" \"&AN44","v":"OP-OV INN"},null,null,null,"Number of Rows","6",null,"Classification Code","3b",{"$f":"AW43&\" \"&AW44","v":"OP-AO INN"},null,null,null,"Number of Rows","6",null,"Classification Code",4,{"$f":"BF43&\" \"&BF44","v":"OP OON"},null,null,null,"Number of Rows","6",null,"Classification Code","4a",{"$f":"BO43&\" \"&BO44","v":"OP-OV OON"},null,null,null,"Number of Rows","6",null,"Classification Code","4b",{"$f":"BX43&\" \"&BX44","v":"OP-AO OON"},null,null,null,"Number of Rows","6",null,"Classification Code",5,{"$f":"CG43&\" \"&CG44","v":"ER "},null,null,null,"Number of Rows","6",null,"Classification Code",6,{"$f":"CP43&\" \"&CP44","v":"RX "}]
[null,null,null,null,null,null,null,null,null,null,"Table Name",null,{"$f":"SUBSTITUTE(SUBSTITUTE(\"tbl_\"&M45&\"_P1\",\" \",\"\"),\"-\",\"\")","v":"tbl_IPINN_P1"},null,null,null,null,null,null,"Table Name",null,{"$f":"SUBSTITUTE(SUBSTITUTE(\"tbl_\"&V45&\"_P1\",\" \",\"\"),\"-\",\"\")","v":"tbl_IPOON_P1"},null,null,null,null,null,null,"Table Name",null,{"$f":"SUBSTITUTE(SUBSTITUTE(\"tbl_\"&AE45&\"_P1\",\" \",\"\"),\"-\",\"\")","v":"tbl_OPINN_P1"},null,null,null,null,null,null,"Table Name",null,{"$f":"SUBSTITUTE(SUBSTITUTE(\"tbl_\"&AN45&\"_P1\",\" \",\"\"),\"-\",\"\")","v":"tbl_OPOVINN_P1"},null,null,null,null,null,null,"Table Name",null,{"$f":"SUBSTITUTE(SUBSTITUTE(\"tbl_\"&AW45&\"_P1\",\" \",\"\"),\"-\",\"\")","v":"tbl_OPAOINN_P1"},null,null,null,null,null,null,"Table Name",null,{"$f":"SUBSTITUTE(SUBSTITUTE(\"tbl_\"&BF45&\"_P1\",\" \",\"\"),\"-\",\"\")","v":"tbl_OPOON_P1"},null,null,null,null,null,null,"Table Name",null,{"$f":"SUBSTITUTE(SUBSTITUTE(\"tbl_\"&BO45&\"_P1\",\" \",\"\"),\"-\",\"\")","v":"tbl_OPOVOON_P1"},null,null,null,null,null,null,"Table Name",null,{"$f":"SUBSTITUTE(SUBSTITUTE(\"tbl_\"&BX45&\"_P1\",\" \",\"\"),\"-\",\"\")","v":"tbl_OPAOOON_P1"},null,null,null,null,null,null,"Table Name",null,{"$f":"SUBSTITUTE(SUBSTITUTE(\"tbl_\"&CG45&\"_P1\",\" \",\"\"),\"-\",\"\")","v":"tbl_ER_P1"},null,null,null,null,null,null,"Table Name",null,{"$f":"SUBSTITUTE(SUBSTITUTE(\"tbl_\"&CP45&\"_P1\",\" \",\"\"),\"-\",\"\")","v":"tbl_RX_P1"},null,null,null,"Number of Rows","6"]
[null,null,null,null,null,null,null,null,null,null,"For each cost share, if it does not apply, enter \"N/A\".",null,null,null,null,null,null,null,null,"For each cost share, if it does not apply, enter \"N/A\".",null,null,null,null,null,null,null,null,"For each cost share, if it does not apply, enter \"N/A\".",null,null,null,null,null,null,null,null,"For each cost share, if it does not apply, enter \"N/A\".",null,null,null,null,null,null,null,null,"For each cost share, if it does not apply, enter \"N/A\".",null,null,null,null,null,null,null,null,"For each cost share, if it does not apply, enter \"N/A\".",null,null,null,null,null,null,null,null,"For each cost share, if it does not apply, enter \"N/A\".",null,null,null,null,null,null,null,null,"For each cost share, if it does not apply, enter \"N/A\".",null,null,null,null,null,null,null,null,"For each cost share, if it does not apply, enter \"N/A\".",null,null,null,null,null,null,null,null,"For each cost share, if it does not apply, enter \"N/A\"."]
[null,null,null,null,null,null,null,null,null,null,"Service Description","Cost-Share Description","Plan Projected Allowed Amount","Deductible","Copayment","Coinsurance","Out-of-Pocket Maximum (OOPM)","No Cost-Share\n(If true, \nenter \"x\")",null,"Service Description","Cost-Share Description","Plan Projected Allowed Amount","Deductible","Copayment","Coinsurance","Out-of-Pocket Maximum (OOPM)","No Cost-Share\n(If true, \nenter \"x\")",null,"Service Description","Cost-Share Description","Plan Projected Allowed Amount","Deductible","Copayment","Coinsurance","Out-of-Pocket Maximum (OOPM)","No Cost-Share\n(If true, \nenter \"x\")",null,"Service Description","Cost-Share Description","Plan Projected Allowed Amount","Deductible","Copayment","Coinsurance","Out-of-Pocket Maximum (OOPM)","No Cost-Share\n(If true, \nenter \"x\")",null,"Service Description","Cost-Share Description","Plan Projected Allowed Amount","Deductible","Copayment","Coinsurance","Out-of-Pocket Maximum (OOPM)","No Cost-Share\n(If true, \nenter \"x\")",null,"Service Description","Cost-Share Description","Plan Projected Allowed Amount","Deductible","Copayment","Coinsurance","Out-of-Pocket Maximum (OOPM)","No Cost-Share\n(If true, \nenter \"x\")",null,"Service Description","Cost-Share Description","Plan Projected Allowed Amount","Deductible","Copayment","Coinsurance","Out-of-Pocket Maximum (OOPM)","No Cost-Share\n(If true, \nenter \"x\")",null,"Service Description","Cost-Share Description","Plan Projected Allowed Amount","Deductible","Copayment","Coinsurance","Out-of-Pocket Maximum (OOPM)","No Cost-Share\n(If true, \nenter \"x\")",null,"Service Description","Cost-Share Description","Plan Projected Allowed Amount","Deductible","Copayment","Coinsurance","Out-of-Pocket Maximum (OOPM)","No Cost-Share\n(If true, \nenter \"x\")",null,"Service Description","Cost-Share Description","Plan Projected Allowed Amount","Deductible","Copayment","Coinsurance","Out-of-Pocket Maximum (OOPM)","No Cost-Share\n(If true, \nenter \"x\")"]
[null,null,null,null,null,null,null,null,null,null,"<<Enter description>>","Before Deductible",346,"N/A",15,0.2,8000,null,null,"<<Enter description>>","<<Enter description>>",123,500,15,0.2,8000,null,null,"<<Enter description>>","<<Enter description>>",null,null,null,null,null,null,null,"<<Enter description>>","<<Enter description>>",null,null,null,null,null,null,null,"<<Enter description>>","<<Enter description>>",null,null,null,null,null,null,null,"<<Enter description>>","<<Enter description>>",null,null,null,null,null,null,null,"<<Enter description>>","<<Enter description>>",null,null,null,null,null,null,null,"<<Enter description>>","<<Enter description>>",null,null,null,null,null,null,null,"<<Enter description>>","<<Enter description>>",null,null,null,null,null,null,null,"<<Enter description>>","<<Enter description>>"]
[null,null,null,null,null,null,null,null,null,null,"<<Enter description>>","After Deductible",140,500,15,"N/A",8000,null,null,"<<Enter description>>","<<Enter description>>",300,550,30,"N/A",8000]
[null,null,null,null,null,null,null,null,null,null,"<<Enter description>>","Before and After Deductible",639,500,15,0.3,8000,null,null,"<<Preventive Services description>>","<<Enter description>>",100,"N/A","N/A","N/A","N/A","x"]
[null,null,null,null,null,null,null,null,null,null,"<<Enter description>>","Before Deductible",369,500,15,0.5,8000,null,null,"<<Enter description>>","<<Enter description>>",57,500,20,"N/A",8000]
[null,null,null,null,null,null,null,null,null,null,"<<Enter description>>","After Deductible",466,500,30,"N/A",8000,null,null,"<<Enter description>>","<<Enter description>>",64,500,30,0.2,8000]
[null,null,null,null,null,null,null,null,null,null,"<<Enter description>>","Before and After Deductible",325,500,45,"N/A",8000,null,null,"<<Enter description>>","<<Enter description>>",38,500,"N/A",0.25,8000]
[null,null,null,null,null,null,null,null,null,null,"Total Row",null,{"$f":"SUBTOTAL(109,tbl_IPINN_P15[Plan Projected Allowed Amount])","v":2285},null,null,null,null,null,null,"<<Enter description>>","<<Enter description>>",40,500,15,0.2,8000,null,null,"Total Row",null,{"$f":"SUBTOTAL(109,tbl_OPINN_P115[Plan Projected Allowed Amount])","v":0},null,null,null,null,null,null,"Total Row",null,{"$f":"SUBTOTAL(109,tbl_OPOVINN_P120[Plan Projected Allowed Amount])","v":0},null,null,null,null,null,null,"Total Row",null,{"$f":"SUBTOTAL(109,tbl_OPAOINN_P125[Plan Projected Allowed Amount])","v":0},null,null,null,null,null,null,"Total Row",null,{"$f":"SUBTOTAL(109,tbl_OPOON_P130[Plan Projected Allowed Amount])","v":0},null,null,null,null,null,null,"Total Row",null,{"$f":"SUBTOTAL(109,tbl_OPOVOON_P135[Plan Projected Allowed Amount])","v":0},null,null,null,null,null,null,"Total Row",null,{"$f":"SUBTOTAL(109,tbl_OPAOOON_P140[Plan Projected Allowed Amount])","v":0},null,null,null,null,null,null,"Total Row",null,{"$f":"SUBTOTAL(109,tbl_ER_P145[Plan Projected Allowed Amount])","v":0},null,null,null,null,null,null,"Total Row",null,{"$f":"SUBTOTAL(109,tbl_RX_P149[Plan Projected Allowed Amount])","v":0}]
[null,null,null,null,null,null,null,null,null,null,null,null,null,null,null,null,null,null,null,"<<Enter description>>","<<Enter description>>",37,500,15,0.2,8000]
[null,null,null,null,null,null,null,null,null,null,null,null,null,null,null,null,null,null,null,"Total Row",null,{"$f":"SUBTOTAL(109,tbl_IPOON_P110[Plan Projected Allowed Amount])","v":759}]
[]
[null,null,null,null,null,null,null,null,null,null,"PART 2",null,null,null,null,null,null,null,null,"PART 2",null,null,null,null,null,null,null,null,"PART 2",null,null,null,null,null,null,null,null,"PART 2",null,null,null,null,null,null,null,null,"PART 2",null,null,null,null,null,null,null,null,"PART 2",null,null,null,null,null,null,null,null,"PART 2",null,null,null,null,null,null,null,null,"PART 2",null,null,null,null,null,null,null,null,"PART 2",null,null,null,null,null,null,null,null,"PART 2"]
[null,null,null,null,null,null,null,null,null,null,"ANALYSIS OF MHSUD FINANCIAL REQUIREMENT PARITY, BY BENEFIT CLASSIFICATION",null,null,null,null,null,null,null,null,"ANALYSIS OF MHSUD FINANCIAL REQUIREMENT PARITY, BY BENEFIT CLASSIFICATION",null,null,null,null,null,null,null,null,"ANALYSIS OF MHSUD FINANCIAL REQUIREMENT PARITY, BY BENEFIT CLASSIFICATION",null,null,null,null,null,null,null,null,"ANALYSIS OF MHSUD FINANCIAL REQUIREMENT PARITY, BY BENEFIT CLASSIFICATION",null,null,null,null,null,null,null,null,"ANALYSIS OF MHSUD FINANCIAL REQUIREMENT PARITY, BY BENEFIT CLASSIFICATION",null,null,null,null,null,null,null,null,"ANALYSIS OF MHSUD FINANCIAL REQUIREMENT PARITY, BY BENEFIT CLASSIFICATION",null,null,null,null,null,null,null,null,"ANALYSIS OF MHSUD FINANCIAL REQUIREMENT PARITY, BY BENEFIT CLASSIFICATION",null,null,null,null,null,null,null,null,"ANALYSIS OF MHSUD FINANCIAL REQUIREMENT PARITY, BY BENEFIT CLASSIFICATION",null,null,null,null,null,null,null,null,"ANALYSIS OF MHSUD FINANCIAL REQUIREMENT PARITY, BY BENEFIT CLASSIFICATION",null,null,null,null,null,null,null,null,"ANALYSIS OF MHSUD FINANCIAL REQUIREMENT PARITY, BY BENEFIT CLASSIFICATION"]
[]
[null,null,null,null,null,null,null,null,null,null,{"$f":"\"Financial Parity for \"&L40","v":"Financial Parity for (1) Inpatient, In-Network (IP INN)"},null,null,null,null,null,null,null,null,{"$f":"\"Financial Parity for \"&U40","v":"Financial Parity for (2) Inpatient, Out-of-Network (IP OON)"},null,null,null,null,null,null,null,null,{"$f":"\"Financial Parity for \"&AD40","v":"Financial Parity for (3) Outpatient, In-Network (OP INN)"},null,null,null,null,null,null,null,null,{"$f":"\"Financial Parity for \"&AM40","v":"Financial Parity for (3a) Outpatient - Office Visits, In-Network (OP-OV INN)"},null,null,null,null,null,null,null,null,{"$f":"\"Financial Parity for \"&AV40","v":"Financial Parity for (3b) Outpatient - All Other, In-Network (OP-AO INN)"},null,null,null,null,null,null,null,null,{"$f":"\"Financial Parity for \"&BE40","v":"Financial Parity for (4) Outpatient, Out-of-Network (OP OON)"},null,null,null,null,null,null,null,null,{"$f":"\"Financial Parity for \"&BN40","v":"Financial Parity for (4a) Outpatient - Office Visits, Out-of-Network (OP-OV OON)"},null,null,null,null,null,null,null,null,{"$f":"\"Financial Parity for \"&BW40","v":"Financial Parity for (4b) Outpatient - All Other, Out-of-Network (OP-AO OON)"},null,null,null,null,null,null,null,null,{"$f":"\"Financial Parity for \"&CF40","v":"Financial Parity for (5) Emergency Care,  (ER )"},null,null,null,null,null,null,null,null,{"$f":"\"Financial Parity for \"&CO40","v":"Financial Parity for (6) Prescription Drugs,  (RX )"}]
[null,null,null,null,null,null,null,null,null,null,"Cost-Share Type","MHSUD Cost Shares\nin Plan Design*","Predominant Level for Medical/ Surgical","MHSUD Financial Parity Result",null,"Enter Footnotes \n(as needed) about\nMHSUD Cost Shares\nin the Plan Design",null,null,null,"Cost-Share Type","MHSUD Cost Shares\nin Plan Design*","Predominant Level for Medical/ Surgical","MHSUD Financial Parity Result",null,"Enter Footnotes \n(as needed) about\nMHSUD Cost Shares\nin the Plan Design",null,null,null,"Cost-Share Type","MHSUD Cost Shares\nin Plan Design*","Predominant Level for Medical/ Surgical","MHSUD Financial Parity Result",null,"Enter Footnotes \n(as needed) about\nMHSUD Cost Shares\nin the Plan Design",null,null,null,"Cost-Share Type","MHSUD Cost Shares\nin Plan Design*","Predominant Level for Medical/ Surgical","MHSUD Financial Parity Result",null,"Enter Footnotes \n(as needed) about\nMHSUD Cost Shares\nin the Plan Design",null,null,null,"Cost-Share Type","MHSUD Cost Shares\nin Plan Design*","Predominant Level for Medical/ Surgical","MHSUD Financial Parity Result",null,"Enter Footnotes \n(as needed) about\nMHSUD Cost Shares\nin the Plan Design",null,null,null,"Cost-Share Type","MHSUD Cost Shares\nin Plan Design*","Predominant Level for Medical/ Surgical","MHSUD Financial Parity Result",null,"Enter Footnotes \n(as needed) about\nMHSUD Cost Shares\nin the Plan Design",null,null,null,"Cost-Share Type","MHSUD Cost Shares\nin Plan Design*","Predominant Level for Medical/ Surgical","MHSUD Financial Parity Result",null,"Enter Footnotes \n(as needed) about\nMHSUD Cost Shares\nin the Plan Design",null,null,null,"Cost-Share Type","MHSUD Cost Shares\nin Plan Design*","Predominant Level for Medical/ Surgical","MHSUD Financial Parity Result",null,"Enter Footnotes \n(as needed) about\nMHSUD Cost Shares\nin the Plan Design",null,null,null,"Cost-Share Type","MHSUD Cost Shares\nin Plan Design*","Predominant Level for Medical/ Surgical","MHSUD Financial Parity Result",null,"Enter Footnotes \n(as needed) about\nMHSUD Cost Shares\nin the Plan Design",null,null,null,"Cost-Share Type","MHSUD Cost Shares\nin Plan Design*","Predominant Level for Medical/ Surgical","MHSUD Financial Parity Result",null,"Enter Footnotes \n(as needed) about\nMHSUD Cost Shares\nin the Plan Design"]
[null,null,null,null,null,null,null,null,null,null,"Deductible",500,{"$f":"IF(OR(N71=\"Fail\",N71=\"N/A\"),N71,MAX(tbl_IPINN_P2Ded6[Predominant & Smaller]))","v":500},{"$f":"IF(AND(OR(L64=\"\",L64=\"N/A\"),N71=\"N/A\"),\"N/A\",IF(AND(OR(M64=\"N/A\",M64=\"Fail\"),OR(L64=\"N/A\",L64=\"Not Applicable\")),\"Pass\",IF(M64=\"Fail\",M64,IF(L64=\"\",\"Fail - Enter MHSUD cost share\",IF(AND(M64<>\"N/A\",M64<>\"Fail\",OR(AND(L64<=M64,L64>=0),L64=\"N/A\",L64=\"Not Applicable\")),\"Pass\",\"Fail\")))))","v":"Pass"},null,"xx",null,null,null,"Deductible",500,{"$f":"IF(OR(W71=\"Fail\",W71=\"N/A\"),W71,MAX(tbl_IPOON_P2Ded11[Predominant & Smaller]))","v":500},{"$f":"IF(AND(OR(U64=\"\",U64=\"N/A\"),W71=\"N/A\"),\"N/A\",IF(AND(OR(V64=\"N/A\",V64=\"Fail\"),OR(U64=\"N/A\",U64=\"Not Applicable\")),\"Pass\",IF(V64=\"Fail\",V64,IF(U64=\"\",\"Fail - Enter MHSUD cost share\",IF(AND(V64<>\"N/A\",V64<>\"Fail\",OR(AND(U64<=V64,U64>=0),U64=\"N/A\",U64=\"Not Applicable\")),\"Pass\",\"Fail\")))))","v":"Pass"},null,"xx",null,null,null,"Deductible",null,{"$f":"IF(OR(AF71=\"Fail\",AF71=\"N/A\"),AF71,MAX(tbl_OPINN_P2Ded16[Predominant & Smaller]))","v":"N/A"},{"$f":"IF(AND(OR(AD64=\"\",AD64=\"N/A\"),AF71=\"N/A\"),\"N/A\",IF(AND(OR(AE64=\"N/A\",AE64=\"Fail\"),OR(AD64=\"N/A\",AD64=\"Not Applicable\")),\"Pass\",IF(AE64=\"Fail\",AE64,IF(AD64=\"\",\"Fail - Enter MHSUD cost share\",IF(AND(AE64<>\"N/A\",AE64<>\"Fail\",OR(AND(AD64<=AE64,AD64>=0),AD64=\"N/A\",AD64=\"Not Applicable\")),\"Pass\",\"Fail\")))))","v":"N/A"},null,"xx",null,null,null,"Deductible",null,{"$f":"IF(OR(AO71=\"Fail\",AO71=\"N/A\"),AO71,MAX(tbl_OPOVINN_P2Ded21[Predominant & Smaller]))","v":"N/A"},{"$f":"IF(AND(OR(AM64=\"\",AM64=\"N/A\"),AO71=\"N/A\"),\"N/A\",IF(AND(OR(AN64=\"N/A\",AN64=\"Fail\"),OR(AM64=\"N/A\",AM64=\"Not Applicable\")),\"Pass\",IF(AN64=\"Fail\",AN64,IF(AM64=\"\",\"Fail - Enter MHSUD cost share\",IF(AND(AN64<>\"N/A\",AN64<>\"Fail\",OR(AND(AM64<=AN64,AM64>=0),AM64=\"N/A\",AM64=\"Not Applicable\")),\"Pass\",\"Fail\")))))","v":"N/A"},null,"xx",null,null,null,"Deductible",null,{"$f":"IF(OR(AX71=\"Fail\",AX71=\"N/A\"),AX71,MAX(tbl_OPAOINN_P2Ded26[Predominant & Smaller]))","v":"N/A"},{"$f":"IF(AND(OR(AV64=\"\",AV64=\"N/A\"),AX71=\"N/A\"),\"N/A\",IF(AND(OR(AW64=\"N/A\",AW64=\"Fail\"),OR(AV64=\"N/A\",AV64=\"Not Applicable\")),\"Pass\",IF(AW64=\"Fail\",AW64,IF(AV64=\"\",\"Fail - Enter MHSUD cost share\",IF(AND(AW64<>\"N/A\",AW64<>\"Fail\",OR(AND(AV64<=AW64,AV64>=0),AV64=\"N/A\",AV64=\"Not Applicable\")),\"Pass\",\"Fail\")))))","v":"N/A"},null,"xx",null,null,null,"Deductible",null,{"$f":"IF(OR(BG71=\"Fail\",BG71=\"N/A\"),BG71,MAX(tbl_OPOON_P2Ded31[Predominant & Smaller]))","v":"N/A"},{"$f":"IF(AND(OR(BE64=\"\",BE64=\"N/A\"),BG71=\"N/A\"),\"N/A\",IF(AND(OR(BF64=\"N/A\",BF64=\"Fail\"),OR(BE64=\"N/A\",BE64=\"Not Applicable\")),\"Pass\",IF(BF64=\"Fail\",BF64,IF(BE64=\"\",\"Fail - Enter MHSUD cost share\",IF(AND(BF64<>\"N/A\",BF64<>\"Fail\",OR(AND(BE64<=BF64,BE64>=0),BE64=\"N/A\",BE64=\"Not Applicable\")),\"Pass\",\"Fail\")))))","v":"N/A"},null,"xx",null,null,null,"Deductible",null,{"$f":"IF(OR(BP71=\"Fail\",BP71=\"N/A\"),BP71,MAX(tbl_OPOVOON_P2Ded36[Predominant & Smaller]))","v":"N/A"},{"$f":"IF(AND(OR(BN64=\"\",BN64=\"N/A\"),BP71=\"N/A\"),\"N/A\",IF(AND(OR(BO64=\"N/A\",BO64=\"Fail\"),OR(BN64=\"N/A\",BN64=\"Not Applicable\")),\"Pass\",IF(BO64=\"Fail\",BO64,IF(BN64=\"\",\"Fail - Enter MHSUD cost share\",IF(AND(BO64<>\"N/A\",BO64<>\"Fail\",OR(AND(BN64<=BO64,BN64>=0),BN64=\"N/A\",BN64=\"Not Applicable\")),\"Pass\",\"Fail\")))))","v":"N/A"},null,"xx",null,null,null,"Deductible",null,{"$f":"IF(OR(BY71=\"Fail\",BY71=\"N/A\"),BY71,MAX(tbl_OPAOOON_P2Ded41[Predominant & Smaller]))","v":"N/A"},{"$f":"IF(AND(OR(BW64=\"\",BW64=\"N/A\"),BY71=\"N/A\"),\"N/A\",IF(AND(OR(BX64=\"N/A\",BX64=\"Fail\"),OR(BW64=\"N/A\",BW64=\"Not Applicable\")),\"Pass\",IF(BX64=\"Fail\",BX64,IF(BW64=\"\",\"Fail - Enter MHSUD cost share\",IF(AND(BX64<>\"N/A\",BX64<>\"Fail\",OR(AND(BW64<=BX64,BW64>=0),BW64=\"N/A\",BW64=\"Not Applicable\")),\"Pass\",\"Fail\")))))","v":"N/A"},null,"xx",null,null,null,"Deductible",null,{"$f":"IF(OR(CH71=\"Fail\",CH71=\"N/A\"),CH71,MAX(tbl_ER_P2Ded54[Predominant & Smaller]))","v":"N/A"},{"$f":"IF(AND(OR(CF64=\"\",CF64=\"N/A\"),CH71=\"N/A\"),\"N/A\",IF(AND(OR(CG64=\"N/A\",CG64=\"Fail\"),OR(CF64=\"N/A\",CF64=\"Not Applicable\")),\"Pass\",IF(CG64=\"Fail\",CG64,IF(CF64=\"\",\"Fail - Enter MHSUD cost share\",IF(AND(CG64<>\"N/A\",CG64<>\"Fail\",OR(AND(CF64<=CG64,CF64>=0),CF64=\"N/A\",CF64=\"Not Applicable\")),\"Pass\",\"Fail\")))))","v":"N/A"},null,"xx",null,null,null,"Deductible",null,{"$f":"IF(OR(CQ71=\"Fail\",CQ71=\"N/A\"),CQ71,MAX(tbl_RX_P2Ded50[Predominant & Smaller]))","v":"N/A"},{"$f":"IF(AND(OR(CO64=\"\",CO64=\"N/A\"),CQ71=\"N/A\"),\"N/A\",IF(AND(OR(CP64=\"N/A\",CP64=\"Fail\"),OR(CO64=\"N/A\",CO64=\"Not Applicable\")),\"Pass\",IF(CP64=\"Fail\",CP64,IF(CO64=\"\",\"Fail - Enter MHSUD cost share\",IF(AND(CP64<>\"N/A\",CP64<>\"Fail\",OR(AND(CO64<=CP64,CO64>=0),CO64=\"N/A\",CO64=\"Not Applicable\")),\"Pass\",\"Fail\")))))","v":"N/A"},null,"xx"]
[null,null,null,null,null,null,null,null,null,null,"Copayment","N/A",{"$f":"IF(OR(N72=\"Fail\",N72=\"N/A\"),N72,MAX(tbl_IPINN_P2Cop7[Predominant & Smaller]))","v":15},{"$f":"IF(AND(OR(L65=\"\",L65=\"N/A\"),N72=\"N/A\"),\"N/A\",IF(AND(OR(M65=\"N/A\",M65=\"Fail\"),OR(L65=\"N/A\",L65=\"Not Applicable\")),\"Pass\",IF(M65=\"Fail\",M65,IF(L65=\"\",\"Fail - Enter MHSUD cost share\",IF(AND(M65<>\"N/A\",M65<>\"Fail\",OR(AND(L65<=M65,L65>=0),L65=\"N/A\",L65=\"Not Applicable\")),\"Pass\",\"Fail\")))))","v":"Pass"},null,null,null,null,null,"Copayment",15,{"$f":"IF(OR(W72=\"Fail\",W72=\"N/A\"),W72,MAX(tbl_IPOON_P2Cop12[Predominant & Smaller]))","v":30},{"$f":"IF(AND(OR(U65=\"\",U65=\"N/A\"),W72=\"N/A\"),\"N/A\",IF(AND(OR(V65=\"N/A\",V65=\"Fail\"),OR(U65=\"N/A\",U65=\"Not Applicable\")),\"Pass\",IF(V65=\"Fail\",V65,IF(U65=\"\",\"Fail - Enter MHSUD cost share\",IF(AND(V65<>\"N/A\",V65<>\"Fail\",OR(AND(U65<=V65,U65>=0),U65=\"N/A\",U65=\"Not Applicable\")),\"Pass\",\"Fail\")))))","v":"Pass"},null,null,null,null,null,"Copayment",null,{"$f":"IF(OR(AF72=\"Fail\",AF72=\"N/A\"),AF72,MAX(tbl_OPINN_P2Cop17[Predominant & Smaller]))","v":"N/A"},{"$f":"IF(AND(OR(AD65=\"\",AD65=\"N/A\"),AF72=\"N/A\"),\"N/A\",IF(AND(OR(AE65=\"N/A\",AE65=\"Fail\"),OR(AD65=\"N/A\",AD65=\"Not Applicable\")),\"Pass\",IF(AE65=\"Fail\",AE65,IF(AD65=\"\",\"Fail - Enter MHSUD cost share\",IF(AND(AE65<>\"N/A\",AE65<>\"Fail\",OR(AND(AD65<=AE65,AD65>=0),AD65=\"N/A\",AD65=\"Not Applicable\")),\"Pass\",\"Fail\")))))","v":"N/A"},null,null,null,null,null,"Copayment",null,{"$f":"IF(OR(AO72=\"Fail\",AO72=\"N/A\"),AO72,MAX(tbl_OPOVINN_P2Cop22[Predominant & Smaller]))","v":"N/A"},{"$f":"IF(AND(OR(AM65=\"\",AM65=\"N/A\"),AO72=\"N/A\"),\"N/A\",IF(AND(OR(AN65=\"N/A\",AN65=\"Fail\"),OR(AM65=\"N/A\",AM65=\"Not Applicable\")),\"Pass\",IF(AN65=\"Fail\",AN65,IF(AM65=\"\",\"Fail - Enter MHSUD cost share\",IF(AND(AN65<>\"N/A\",AN65<>\"Fail\",OR(AND(AM65<=AN65,AM65>=0),AM65=\"N/A\",AM65=\"Not Applicable\")),\"Pass\",\"Fail\")))))","v":"N/A"},null,null,null,null,null,"Copayment",null,{"$f":"IF(OR(AX72=\"Fail\",AX72=\"N/A\"),AX72,MAX(tbl_OPAOINN_P2Cop27[Predominant & Smaller]))","v":"N/A"},{"$f":"IF(AND(OR(AV65=\"\",AV65=\"N/A\"),AX72=\"N/A\"),\"N/A\",IF(AND(OR(AW65=\"N/A\",AW65=\"Fail\"),OR(AV65=\"N/A\",AV65=\"Not Applicable\")),\"Pass\",IF(AW65=\"Fail\",AW65,IF(AV65=\"\",\"Fail - Enter MHSUD cost share\",IF(AND(AW65<>\"N/A\",AW65<>\"Fail\",OR(AND(AV65<=AW65,AV65>=0),AV65=\"N/A\",AV65=\"Not Applicable\")),\"Pass\",\"Fail\")))))","v":"N/A"},null,null,null,null,null,"Copayment",null,{"$f":"IF(OR(BG72=\"Fail\",BG72=\"N/A\"),BG72,MAX(tbl_OPOON_P2Cop32[Predominant & Smaller]))","v":"N/A"},{"$f":"IF(AND(OR(BE65=\"\",BE65=\"N/A\"),BG72=\"N/A\"),\"N/A\",IF(AND(OR(BF65=\"N/A\",BF65=\"Fail\"),OR(BE65=\"N/A\",BE65=\"Not Applicable\")),\"Pass\",IF(BF65=\"Fail\",BF65,IF(BE65=\"\",\"Fail - Enter MHSUD cost share\",IF(AND(BF65<>\"N/A\",BF65<>\"Fail\",OR(AND(BE65<=BF65,BE65>=0),BE65=\"N/A\",BE65=\"Not Applicable\")),\"Pass\",\"Fail\")))))","v":"N/A"},null,null,null,null,null,"Copayment",null,{"$f":"IF(OR(BP72=\"Fail\",BP72=\"N/A\"),BP72,MAX(tbl_OPOVOON_P2Cop37[Predominant & Smaller]))","v":"N/A"},{"$f":"IF(AND(OR(BN65=\"\",BN65=\"N/A\"),BP72=\"N/A\"),\"N/A\",IF(AND(OR(BO65=\"N/A\",BO65=\"Fail\"),OR(BN65=\"N/A\",BN65=\"Not Applicable\")),\"Pass\",IF(BO65=\"Fail\",BO65,IF(BN65=\"\",\"Fail - Enter MHSUD cost share\",IF(AND(BO65<>\"N/A\",BO65<>\"Fail\",OR(AND(BN65<=BO65,BN65>=0),BN65=\"N/A\",BN65=\"Not Applicable\")),\"Pass\",\"Fail\")))))","v":"N/A"},null,null,null,null,null,"Copayment",null,{"$f":"IF(OR(BY72=\"Fail\",BY72=\"N/A\"),BY72,MAX(tbl_OPAOOON_P2Cop42[Predominant & Smaller]))","v":"N/A"},{"$f":"IF(AND(OR(BW65=\"\",BW65=\"N/A\"),BY72=\"N/A\"),\"N/A\",IF(AND(OR(BX65=\"N/A\",BX65=\"Fail\"),OR(BW65=\"N/A\",BW65=\"Not Applicable\")),\"Pass\",IF(BX65=\"Fail\",BX65,IF(BW65=\"\",\"Fail - Enter MHSUD cost share\",IF(AND(BX65<>\"N/A\",BX65<>\"Fail\",OR(AND(BW65<=BX65,BW65>=0),BW65=\"N/A\",BW65=\"Not Applicable\")),\"Pass\",\"Fail\")))))","v":"N/A"},null,null,null,null,null,"Copayment",null,{"$f":"IF(OR(CH72=\"Fail\",CH72=\"N/A\"),CH72,MAX(tbl_ER_P2Cop46[Predominant & Smaller]))","v":"N/A"},{"$f":"IF(AND(OR(CF65=\"\",CF65=\"N/A\"),CH72=\"N/A\"),\"N/A\",IF(AND(OR(CG65=\"N/A\",CG65=\"Fail\"),OR(CF65=\"N/A\",CF65=\"Not Applicable\")),\"Pass\",IF(CG65=\"Fail\",CG65,IF(CF65=\"\",\"Fail - Enter MHSUD cost share\",IF(AND(CG65<>\"N/A\",CG65<>\"Fail\",OR(AND(CF65<=CG65,CF65>=0),CF65=\"N/A\",CF65=\"Not Applicable\")),\"Pass\",\"Fail\")))))","v":"N/A"},null,null,null,null,null,"Copayment",null,{"$f":"IF(OR(CQ72=\"Fail\",CQ72=\"N/A\"),CQ72,MAX(tbl_RX_P2Cop51[Predominant & Smaller]))","v":"N/A"},{"$f":"IF(AND(OR(CO65=\"\",CO65=\"N/A\"),CQ72=\"N/A\"),\"N/A\",IF(AND(OR(CP65=\"N/A\",CP65=\"Fail\"),OR(CO65=\"N/A\",CO65=\"Not Applicable\")),\"Pass\",IF(CP65=\"Fail\",CP65,IF(CO65=\"\",\"Fail - Enter MHSUD cost share\",IF(AND(CP65<>\"N/A\",CP65<>\"Fail\",OR(AND(CO65<=CP65,CO65>=0),CO65=\"N/A\",CO65=\"Not Applicable\")),\"Pass\",\"Fail\")))))","v":"N/A"}]
[null,null,null,null,null,null,null,null,null,null,"Coinsurance",0.25,{"$f":"IF(OR(N73=\"Fail\",N73=\"N/A\"),N73,MAX(tbl_IPINN_P2Coi8[Predominant & Smaller]))","v":"Fail"},{"$f":"IF(AND(OR(L66=\"\",L66=\"N/A\"),N73=\"N/A\"),\"N/A\",IF(AND(OR(M66=\"N/A\",M66=\"Fail\"),OR(L66=\"N/A\",L66=\"Not Applicable\")),\"Pass\",IF(M66=\"Fail\",M66,IF(L66=\"\",\"Fail - Enter MHSUD cost share\",IF(AND(M66<>\"N/A\",M66<>\"Fail\",OR(AND(L66<=M66,L66>=0),L66=\"N/A\",L66=\"Not Applicable\")),\"Pass\",\"Fail\")))))","v":"Fail"},null,null,null,null,null,"Coinsurance","N/A",{"$f":"IF(OR(W73=\"Fail\",W73=\"N/A\"),W73,MAX(tbl_IPOON_P2Coi13[Predominant & Smaller]))","v":"Fail"},"Pass",null,null,null,null,null,"Coinsurance",null,{"$f":"IF(OR(AF73=\"Fail\",AF73=\"N/A\"),AF73,MAX(tbl_OPINN_P2Coi18[Predominant & Smaller]))","v":"N/A"},"N/A",null,null,null,null,null,"Coinsurance",null,{"$f":"IF(OR(AO73=\"Fail\",AO73=\"N/A\"),AO73,MAX(tbl_OPOVINN_P2Coi23[Predominant & Smaller]))","v":"N/A"},"N/A",null,null,null,null,null,"Coinsurance",null,{"$f":"IF(OR(AX73=\"Fail\",AX73=\"N/A\"),AX73,MAX(tbl_OPAOINN_P2Coi28[Predominant & Smaller]))","v":"N/A"},"N/A",null,null,null,null,null,"Coinsurance",null,{"$f":"IF(OR(BG73=\"Fail\",BG73=\"N/A\"),BG73,MAX(tbl_OPOON_P2Coi33[Predominant & Smaller]))","v":"N/A"},"N/A",null,null,null,null,null,"Coinsurance",null,{"$f":"IF(OR(BP73=\"Fail\",BP73=\"N/A\"),BP73,MAX(tbl_OPOVOON_P2Coi38[Predominant & Smaller]))","v":"N/A"},"N/A",null,null,null,null,null,"Coinsurance",null,{"$f":"IF(OR(BY73=\"Fail\",BY73=\"N/A\"),BY73,MAX(tbl_OPAOOON_P2Coi43[Predominant & Smaller]))","v":"N/A"},"N/A",null,null,null,null,null,"Coinsurance",null,{"$f":"IF(OR(CH73=\"Fail\",CH73=\"N/A\"),CH73,MAX(tbl_ER_P2Coi47[Predominant & Smaller]))","v":"N/A"},"N/A",null,null,null,null,null,"Coinsurance",null,{"$f":"IF(OR(CQ73=\"Fail\",CQ73=\"N/A\"),CQ73,MAX(tbl_RX_P2Coi52[Predominant & Smaller]))","v":"N/A"},"N/A"]
[null,null,null,null,null,null,null,null,null,null,"OOPM",8000,{"$f":"IF(OR(N74=\"Fail\",N74=\"N/A\"),N74,MAX(tbl_IPINN_P2OOPM9[Predominant & Smaller]))","v":8000},{"$f":"IF(AND(OR(L67=\"\",L67=\"N/A\"),N74=\"N/A\"),\"N/A\",IF(AND(OR(M67=\"N/A\",M67=\"Fail\"),OR(L67=\"N/A\",L67=\"Not Applicable\")),\"Pass\",IF(M67=\"Fail\",M67,IF(L67=\"\",\"Fail - Enter MHSUD cost share\",IF(AND(M67<>\"N/A\",M67<>\"Fail\",OR(AND(L67<=M67,L67>=0),L67=\"N/A\",L67=\"Not Applicable\")),\"Pass\",\"Fail\")))))","v":"Pass"},null,null,null,null,null,"OOPM",8000,{"$f":"IF(OR(W74=\"Fail\",W74=\"N/A\"),W74,MAX(tbl_IPOON_P2OOPM14[Predominant & Smaller]))","v":8000},"Pass",null,null,null,null,null,"OOPM",null,{"$f":"IF(OR(AF74=\"Fail\",AF74=\"N/A\"),AF74,MAX(tbl_OPINN_P2OOPM19[Predominant & Smaller]))","v":"N/A"},"N/A",null,null,null,null,null,"OOPM",null,{"$f":"IF(OR(AO74=\"Fail\",AO74=\"N/A\"),AO74,MAX(tbl_OPOVINN_P2OOPM24[Predominant & Smaller]))","v":"N/A"},"N/A",null,null,null,null,null,"OOPM",null,{"$f":"IF(OR(AX74=\"Fail\",AX74=\"N/A\"),AX74,MAX(tbl_OPAOINN_P2OOPM29[Predominant & Smaller]))","v":"N/A"},"N/A",null,null,null,null,null,"OOPM",null,{"$f":"IF(OR(BG74=\"Fail\",BG74=\"N/A\"),BG74,MAX(tbl_OPOON_P2OOPM34[Predominant & Smaller]))","v":"N/A"},"N/A",null,null,null,null,null,"OOPM",null,{"$f":"IF(OR(BP74=\"Fail\",BP74=\"N/A\"),BP74,MAX(tbl_OPOVOON_P2OOPM39[Predominant & Smaller]))","v":"N/A"},"N/A",null,null,null,null,null,"OOPM",null,{"$f":"IF(OR(BY74=\"Fail\",BY74=\"N/A\"),BY74,MAX(tbl_OPAOOON_P2OOPM44[Predominant & Smaller]))","v":"N/A"},"N/A",null,null,null,null,null,"OOPM",null,{"$f":"IF(OR(CH74=\"Fail\",CH74=\"N/A\"),CH74,MAX(tbl_ER_P2OOPM48[Predominant & Smaller]))","v":"N/A"},"N/A",null,null,null,null,null,"OOPM",null,{"$f":"IF(OR(CQ74=\"Fail\",CQ74=\"N/A\"),CQ74,MAX(tbl_RX_P2OOPM53[Predominant & Smaller]))","v":"N/A"},"N/A"]
[null,null,null,null,null,null,null,null,null,null,"Overall",null,null,{"$f":"IF((COUNTIF(N64:N67,\"Pass\")+COUNTIF(N64:N67,\"N/A\"))=4,\"Pass\",\"Fail\")","v":"Fail"},null,null,null,null,null,"Overall",null,null,{"$f":"IF((COUNTIF(W64:W67,\"Pass\")+COUNTIF(W64:W67,\"N/A\"))=4,\"Pass\",\"Fail\")","v":"Pass"},null,null,null,null,null,"Overall",null,null,{"$f":"IF((COUNTIF(AF64:AF67,\"Pass\")+COUNTIF(AF64:AF67,\"N/A\"))=4,\"Pass\",\"Fail\")","v":"Pass"},null,null,null,null,null,"Overall",null,null,{"$f":"IF((COUNTIF(AO64:AO67,\"Pass\")+COUNTIF(AO64:AO67,\"N/A\"))=4,\"Pass\",\"Fail\")","v":"Pass"},null,null,null,null,null,"Overall",null,null,{"$f":"IF((COUNTIF(AX64:AX67,\"Pass\")+COUNTIF(AX64:AX67,\"N/A\"))=4,\"Pass\",\"Fail\")","v":"Pass"},null,null,null,null,null,"Overall",null,null,{"$f":"IF((COUNTIF(BG64:BG67,\"Pass\")+COUNTIF(BG64:BG67,\"N/A\"))=4,\"Pass\",\"Fail\")","v":"Pass"},null,null,null,null,null,"Overall",null,null,{"$f":"IF((COUNTIF(BP64:BP67,\"Pass\")+COUNTIF(BP64:BP67,\"N/A\"))=4,\"Pass\",\"Fail\")","v":"Pass"},null,null,null,null,null,"Overall",null,null,{"$f":"IF((COUNTIF(BY64:BY67,\"Pass\")+COUNTIF(BY64:BY67,\"N/A\"))=4,\"Pass\",\"Fail\")","v":"Pass"},null,null,null,null,null,"Overall",null,null,{"$f":"IF((COUNTIF(CH64:CH67,\"Pass\")+COUNTIF(CH64:CH67,\"N/A\"))=4,\"Pass\",\"Fail\")","v":"Pass"},null,null,null,null,null,"Overall",null,null,{"$f":"IF((COUNTIF(CQ64:CQ67,\"Pass\")+COUNTIF(CQ64:CQ67,\"N/A\"))=4,\"Pass\",\"Fail\")","v":"Pass"}]
[null,null,null,null,null,null,null,null,null,null,null,"*If not applicable, enter \"N/A\"",null,null,null,null,null,null,null,null,"*If not applicable, enter \"N/A\"",null,null,null,null,null,null,null,null,"*If not applicable, enter \"N/A\"",null,null,null,null,null,null,null,null,"*If not applicable, enter \"N/A\"",null,null,null,null,null,null,null,null,"*If not applicable, enter \"N/A\"",null,null,null,null,null,null,null,null,"*If not applicable, enter \"N/A\"",null,null,null,null,null,null,null,null,"*If not applicable, enter \"N/A\"",null,null,null,null,null,null,null,null,"*If not applicable, enter \"N/A\"",null,null,null,null,null,null,null,null,"*If not applicable, enter \"N/A\"",null,null,null,null,null,null,null,null,"*If not applicable, enter \"N/A\""]
[null,null,null,null,null,null,null,null,null,null,"Step 1 Substantially All (i.e., ≥ ⅔ of medical/surgical benefits)",null,null,null,null,null,null,null,null,"Step 1 Substantially All (i.e., ≥ ⅔ of medical/surgical benefits)",null,null,null,null,null,null,null,null,"Step 1 Substantially All (i.e., ≥ ⅔ of medical/surgical benefits)",null,null,null,null,null,null,null,null,"Step 1 Substantially All (i.e., ≥ ⅔ of medical/surgical benefits)",null,null,null,null,null,null,null,null,"Step 1 Substantially All (i.e., ≥ ⅔ of medical/surgical benefits)",null,null,null,null,null,null,null,null,"Step 1 Substantially All (i.e., ≥ ⅔ of medical/surgical benefits)",null,null,null,null,null,null,null,null,"Step 1 Substantially All (i.e., ≥ ⅔ of medical/surgical benefits)",null,null,null,null,null,null,null,null,"Step 1 Substantially All (i.e., ≥ ⅔ of medical/surgical benefits)",null,null,null,null,null,null,null,null,"Step 1 Substantially All (i.e., ≥ ⅔ of medical/surgical benefits)",null,null,null,null,null,null,null,null,"Step 1 Substantially All (i.e., ≥ ⅔ of medical/surgical benefits)"]
[null,null,null,null,null,null,null,null,null,null,"Deductible",{"$f":"SUMIF(tbl_IPINN_P15[Deductible],\">0\",tbl_IPINN_P15[Plan Projected Allowed Amount])","v":1939},{"$f":"IFERROR(L71/L$75,\"\")","v":0.84857768052516414},{"$f":"IF($D$28=\"Yes\",IF(L71=0,\"Fail\",IF(M71>=(2/3),M$45&\" \"&K71,\"Fail\")),\"N/A\")","v":"IP INN Deductible"},null,null,null,null,null,"Deductible",{"$f":"SUMIF(tbl_IPOON_P110[Deductible],\">0\",tbl_IPOON_P110[Plan Projected Allowed Amount])","v":659},{"$f":"IFERROR(U71/U$75,\"\")","v":0.86824769433465088},{"$f":"IF(AND($F$28=\"Yes\",$C$21=\"Yes\"),IF(U71=0,\"Fail\",IF(V71>=(2/3),V$45&\" \"&T71,\"Fail\")),\"N/A\")","v":"IP OON Deductible"},null,null,null,null,null,"Deductible",{"$f":"SUMIF(tbl_OPINN_P115[Deductible],\">0\",tbl_OPINN_P115[Plan Projected Allowed Amount])","v":0},{"$f":"IFERROR(AD71/AD$75,\"\")","v":""},{"$f":"IF(AND($D$30=\"Yes\",$C$22=\"All Combined\"),IF(AD71=0,\"Fail\",IF(AE71>=(2/3),AE$45&\" \"&AC71,\"Fail\")),\"N/A\")","v":"N/A"},null,null,null,null,null,"Deductible",{"$f":"SUMIF(tbl_OPOVINN_P120[Deductible],\">0\",tbl_OPOVINN_P120[Plan Projected Allowed Amount])","v":0},{"$f":"IFERROR(AM71/AM$75,\"\")","v":""},{"$f":"IF(AND($D$32=\"Yes\",$C$22=\"Office Visits Separate\"),IF(AM71=0,\"Fail\",IF(AN71>=(2/3),AN$45&\" \"&AL71,\"Fail\")),\"N/A\")","v":"N/A"},null,null,null,null,null,"Deductible",{"$f":"SUMIF(tbl_OPAOINN_P125[Deductible],\">0\",tbl_OPAOINN_P125[Plan Projected Allowed Amount])","v":0},{"$f":"IFERROR(AV71/AV$75,\"\")","v":""},{"$f":"IF(AND($D$33=\"Yes\",$C$22=\"Office Visits Separate\"),IF(AV71=0,\"Fail\",IF(AW71>=(2/3),AW$45&\" \"&AU71,\"Fail\")),\"N/A\")","v":"N/A"},null,null,null,null,null,"Deductible",{"$f":"SUMIF(tbl_OPOON_P130[Deductible],\">0\",tbl_OPOON_P130[Plan Projected Allowed Amount])","v":0},{"$f":"IFERROR(BE71/BE$75,\"\")","v":""},{"$f":"IF(AND($F$30=\"Yes\",$C$22=\"All Combined\",$C$21=\"Yes\"),IF(BE71=0,\"Fail\",IF(BF71>=(2/3),BF$45&\" \"&BD71,\"Fail\")),\"N/A\")","v":"N/A"},null,null,null,null,null,"Deductible",{"$f":"SUMIF(tbl_OPOVOON_P135[Deductible],\">0\",tbl_OPOVOON_P135[Plan Projected Allowed Amount])","v":0},{"$f":"IFERROR(BN71/BN$75,\"\")","v":""},{"$f":"IF(AND($F$32=\"Yes\",$C$22=\"Office Visits Separate\",$C$21=\"Yes\"),IF(BN71=0,\"Fail\",IF(BO71>=(2/3),BO$45&\" \"&BM71,\"Fail\")),\"N/A\")","v":"N/A"},null,null,null,null,null,"Deductible",{"$f":"SUMIF(tbl_OPAOOON_P140[Deductible],\">0\",tbl_OPAOOON_P140[Plan Projected Allowed Amount])","v":0},{"$f":"IFERROR(BW71/BW$75,\"\")","v":""},{"$f":"IF(AND($F$33=\"Yes\",$C$22=\"Office Visits Separate\",$C$21=\"Yes\"),IF(BW71=0,\"Fail\",IF(BX71>=(2/3),BX$45&\" \"&BV71,\"Fail\")),\"N/A\")","v":"N/A"},null,null,null,null,null,"Deductible",{"$f":"SUMIF(tbl_ER_P145[Deductible],\">0\",tbl_ER_P145[Plan Projected Allowed Amount])","v":0},{"$f":"IFERROR(CF71/CF$75,\"\")","v":""},{"$f":"IF($D$36=\"Yes\",IF(CF71=0,\"Fail\",IF(CG71>=(2/3),CG$45&\" \"&CE71,\"Fail\")),\"N/A\")","v":"N/A"},null,null,null,null,null,"Deductible",{"$f":"SUMIF(tbl_RX_P149[Deductible],\">0\",tbl_RX_P149[Plan Projected Allowed Amount])","v":0},{"$f":"IFERROR(CO71/CO$75,\"\")","v":""},{"$f":"IF($D$37=\"Yes\",IF(CO71=0,\"Fail\",IF(CP71>=(2/3),CP$45&\" \"&CN71,\"Fail\")),\"N/A\")","v":"N/A"}]
[null,null,null,null,null,null,null,null,null,null,"Copayment",{"$f":"SUMIF(tbl_IPINN_P15[Copayment],\">0\",tbl_IPINN_P15[Plan Projected Allowed Amount])","v":2285},{"$f":"IFERROR(L72/L$75,\"\")","v":1},{"$f":"IF($D$28=\"Yes\",IF(L72=0,\"Fail\",IF(M72>=(2/3),M$45&\" \"&K72,\"Fail\")),\"N/A\")","v":"IP INN Copayment"},null,null,null,null,null,"Copayment",{"$f":"SUMIF(tbl_IPOON_P110[Copayment],\">0\",tbl_IPOON_P110[Plan Projected Allowed Amount])","v":621},{"$f":"IFERROR(U72/U$75,\"\")","v":0.81818181818181823},{"$f":"IF(AND($F$28=\"Yes\",$C$21=\"Yes\"),IF(U72=0,\"Fail\",IF(V72>=(2/3),V$45&\" \"&T72,\"Fail\")),\"N/A\")","v":"IP OON Copayment"},null,null,null,null,null,"Copayment",{"$f":"SUMIF(tbl_OPINN_P115[Copayment],\">0\",tbl_OPINN_P115[Plan Projected Allowed Amount])","v":0},{"$f":"IFERROR(AD72/AD$75,\"\")","v":""},{"$f":"IF(AND($D$30=\"Yes\",$C$22=\"All Combined\"),IF(AD72=0,\"Fail\",IF(AE72>=(2/3),AE$45&\" \"&AC72,\"Fail\")),\"N/A\")","v":"N/A"},null,null,null,null,null,"Copayment",{"$f":"SUMIF(tbl_OPOVINN_P120[Copayment],\">0\",tbl_OPOVINN_P120[Plan Projected Allowed Amount])","v":0},{"$f":"IFERROR(AM72/AM$75,\"\")","v":""},{"$f":"IF(AND($D$32=\"Yes\",$C$22=\"Office Visits Separate\"),IF(AM72=0,\"Fail\",IF(AN72>=(2/3),AN$45&\" \"&AL72,\"Fail\")),\"N/A\")","v":"N/A"},null,null,null,null,null,"Copayment",{"$f":"SUMIF(tbl_OPAOINN_P125[Copayment],\">0\",tbl_OPAOINN_P125[Plan Projected Allowed Amount])","v":0},{"$f":"IFERROR(AV72/AV$75,\"\")","v":""},{"$f":"IF(AND($D$33=\"Yes\",$C$22=\"Office Visits Separate\"),IF(AV72=0,\"Fail\",IF(AW72>=(2/3),AW$45&\" \"&AU72,\"Fail\")),\"N/A\")","v":"N/A"},null,null,null,null,null,"Copayment",{"$f":"SUMIF(tbl_OPOON_P130[Copayment],\">0\",tbl_OPOON_P130[Plan Projected Allowed Amount])","v":0},{"$f":"IFERROR(BE72/BE$75,\"\")","v":""},{"$f":"IF(AND($F$30=\"Yes\",$C$22=\"All Combined\",$C$21=\"Yes\"),IF(BE72=0,\"Fail\",IF(BF72>=(2/3),BF$45&\" \"&BD72,\"Fail\")),\"N/A\")","v":"N/A"},null,null,null,null,null,"Copayment",{"$f":"SUMIF(tbl_OPOVOON_P135[Copayment],\">0\",tbl_OPOVOON_P135[Plan Projected Allowed Amount])","v":0},{"$f":"IFERROR(BN72/BN$75,\"\")","v":""},{"$f":"IF(AND($F$32=\"Yes\",$C$22=\"Office Visits Separate\",$C$21=\"Yes\"),IF(BN72=0,\"Fail\",IF(BO72>=(2/3),BO$45&\" \"&BM72,\"Fail\")),\"N/A\")","v":"N/A"},null,null,null,null,null,"Copayment",{"$f":"SUMIF(tbl_OPAOOON_P140[Copayment],\">0\",tbl_OPAOOON_P140[Plan Projected Allowed Amount])","v":0},{"$f":"IFERROR(BW72/BW$75,\"\")","v":""},{"$f":"IF(AND($F$33=\"Yes\",$C$22=\"Office Visits Separate\",$C$21=\"Yes\"),IF(BW72=0,\"Fail\",IF(BX72>=(2/3),BX$45&\" \"&BV72,\"Fail\")),\"N/A\")","v":"N/A"},null,null,null,null,null,"Copayment",{"$f":"SUMIF(tbl_ER_P145[Copayment],\">0\",tbl_ER_P145[Plan Projected Allowed Amount])","v":0},{"$f":"IFERROR(CF72/CF$75,\"\")","v":""},{"$f":"IF($D$36=\"Yes\",IF(CF72=0,\"Fail\",IF(CG72>=(2/3),CG$45&\" \"&CE72,\"Fail\")),\"N/A\")","v":"N/A"},null,null,null,null,null,"Copayment",{"$f":"SUMIF(tbl_RX_P149[Copayment],\">0\",tbl_RX_P149[Plan Projected Allowed Amount])","v":0},{"$f":"IFERROR(CO72/CO$75,\"\")","v":""},{"$f":"IF($D$37=\"Yes\",IF(CO72=0,\"Fail\",IF(CP72>=(2/3),CP$45&\" \"&CN72,\"Fail\")),\"N/A\")","v":"N/A"}]
[null,null,null,null,null,null,null,null,null,null,"Coinsurance",{"$f":"SUMIF(tbl_IPINN_P15[Coinsurance],\">0\",tbl_IPINN_P15[Plan Projected Allowed Amount])","v":1354},{"$f":"IFERROR(L73/L$75,\"\")","v":0.5925601750547046},{"$f":"IF($D$28=\"Yes\",IF(L73=0,\"Fail\",IF(M73>=(2/3),M$45&\" \"&K73,\"Fail\")),\"N/A\")","v":"Fail"},null,null,null,null,null,"Coinsurance",{"$f":"SUMIF(tbl_IPOON_P110[Coinsurance],\">0\",tbl_IPOON_P110[Plan Projected Allowed Amount])","v":302},{"$f":"IFERROR(U73/U$75,\"\")","v":0.39789196310935443},{"$f":"IF(AND($F$28=\"Yes\",$C$21=\"Yes\"),IF(U73=0,\"Fail\",IF(V73>=(2/3),V$45&\" \"&T73,\"Fail\")),\"N/A\")","v":"Fail"},null,null,null,null,null,"Coinsurance",{"$f":"SUMIF(tbl_OPINN_P115[Coinsurance],\">0\",tbl_OPINN_P115[Plan Projected Allowed Amount])","v":0},{"$f":"IFERROR(AD73/AD$75,\"\")","v":""},{"$f":"IF(AND($D$30=\"Yes\",$C$22=\"All Combined\"),IF(AD73=0,\"Fail\",IF(AE73>=(2/3),AE$45&\" \"&AC73,\"Fail\")),\"N/A\")","v":"N/A"},null,null,null,null,null,"Coinsurance",{"$f":"SUMIF(tbl_OPOVINN_P120[Coinsurance],\">0\",tbl_OPOVINN_P120[Plan Projected Allowed Amount])","v":0},{"$f":"IFERROR(AM73/AM$75,\"\")","v":""},{"$f":"IF(AND($D$32=\"Yes\",$C$22=\"Office Visits Separate\"),IF(AM73=0,\"Fail\",IF(AN73>=(2/3),AN$45&\" \"&AL73,\"Fail\")),\"N/A\")","v":"N/A"},null,null,null,null,null,"Coinsurance",{"$f":"SUMIF(tbl_OPAOINN_P125[Coinsurance],\">0\",tbl_OPAOINN_P125[Plan Projected Allowed Amount])","v":0},{"$f":"IFERROR(AV73/AV$75,\"\")","v":""},{"$f":"IF(AND($D$33=\"Yes\",$C$22=\"Office Visits Separate\"),IF(AV73=0,\"Fail\",IF(AW73>=(2/3),AW$45&\" \"&AU73,\"Fail\")),\"N/A\")","v":"N/A"},null,null,null,null,null,"Coinsurance",{"$f":"SUMIF(tbl_OPOON_P130[Coinsurance],\">0\",tbl_OPOON_P130[Plan Projected Allowed Amount])","v":0},{"$f":"IFERROR(BE73/BE$75,\"\")","v":""},{"$f":"IF(AND($F$30=\"Yes\",$C$22=\"All Combined\",$C$21=\"Yes\"),IF(BE73=0,\"Fail\",IF(BF73>=(2/3),BF$45&\" \"&BD73,\"Fail\")),\"N/A\")","v":"N/A"},null,null,null,null,null,"Coinsurance",{"$f":"SUMIF(tbl_OPOVOON_P135[Coinsurance],\">0\",tbl_OPOVOON_P135[Plan Projected Allowed Amount])","v":0},{"$f":"IFERROR(BN73/BN$75,\"\")","v":""},{"$f":"IF(AND($F$32=\"Yes\",$C$22=\"Office Visits Separate\",$C$21=\"Yes\"),IF(BN73=0,\"Fail\",IF(BO73>=(2/3),BO$45&\" \"&BM73,\"Fail\")),\"N/A\")","v":"N/A"},null,null,null,null,null,"Coinsurance",{"$f":"SUMIF(tbl_OPAOOON_P140[Coinsurance],\">0\",tbl_OPAOOON_P140[Plan Projected Allowed Amount])","v":0},{"$f":"IFERROR(BW73/BW$75,\"\")","v":""},{"$f":"IF(AND($F$33=\"Yes\",$C$22=\"Office Visits Separate\",$C$21=\"Yes\"),IF(BW73=0,\"Fail\",IF(BX73>=(2/3),BX$45&\" \"&BV73,\"Fail\")),\"N/A\")","v":"N/A"},null,null,null,null,null,"Coinsurance",{"$f":"SUMIF(tbl_ER_P145[Coinsurance],\">0\",tbl_ER_P145[Plan Projected Allowed Amount])","v":0},{"$f":"IFERROR(CF73/CF$75,\"\")","v":""},{"$f":"IF($D$36=\"Yes\",IF(CF73=0,\"Fail\",IF(CG73>=(2/3),CG$45&\" \"&CE73,\"Fail\")),\"N/A\")","v":"N/A"},null,null,null,null,null,"Coinsurance",{"$f":"SUMIF(tbl_RX_P149[Coinsurance],\">0\",tbl_RX_P149[Plan Projected Allowed Amount])","v":0},{"$f":"IFERROR(CO73/CO$75,\"\")","v":""},{"$f":"IF($D$37=\"Yes\",IF(CO73=0,\"Fail\",IF(CP73>=(2/3),CP$45&\" \"&CN73,\"Fail\")),\"N/A\")","v":"N/A"}]
[null,null,null,null,null,null,null,null,null,null,"OOPM",{"$f":"SUMIF(tbl_IPINN_P15[Out-of-Pocket Maximum (OOPM)],\">0\",tbl_IPINN_P15[Plan Projected Allowed Amount])","v":2285},{"$f":"IFERROR(L74/L$75,\"\")","v":1},{"$f":"IF($D$28=\"Yes\",IF(L74=0,\"Fail\",IF(M74>=(2/3),M$45&\" \"&K74,\"Fail\")),\"N/A\")","v":"IP INN OOPM"},null,null,null,null,null,"OOPM",{"$f":"SUMIF(tbl_IPOON_P110[Out-of-Pocket Maximum (OOPM)],\">0\",tbl_IPOON_P110[Plan Projected Allowed Amount])","v":659},{"$f":"IFERROR(U74/U$75,\"\")","v":0.86824769433465088},{"$f":"IF(AND($F$28=\"Yes\",$C$21=\"Yes\"),IF(U74=0,\"Fail\",IF(V74>=(2/3),V$45&\" \"&T74,\"Fail\")),\"N/A\")","v":"IP OON OOPM"},null,null,null,null,null,"OOPM",{"$f":"SUMIF(tbl_OPINN_P115[Out-of-Pocket Maximum (OOPM)],\">0\",tbl_OPINN_P115[Plan Projected Allowed Amount])","v":0},{"$f":"IFERROR(AD74/AD$75,\"\")","v":""},{"$f":"IF(AND($D$30=\"Yes\",$C$22=\"All Combined\"),IF(AD74=0,\"Fail\",IF(AE74>=(2/3),AE$45&\" \"&AC74,\"Fail\")),\"N/A\")","v":"N/A"},null,null,null,null,null,"OOPM",{"$f":"SUMIF(tbl_OPOVINN_P120[Out-of-Pocket Maximum (OOPM)],\">0\",tbl_OPOVINN_P120[Plan Projected Allowed Amount])","v":0},{"$f":"IFERROR(AM74/AM$75,\"\")","v":""},{"$f":"IF(AND($D$32=\"Yes\",$C$22=\"Office Visits Separate\"),IF(AM74=0,\"Fail\",IF(AN74>=(2/3),AN$45&\" \"&AL74,\"Fail\")),\"N/A\")","v":"N/A"},null,null,null,null,null,"OOPM",{"$f":"SUMIF(tbl_OPAOINN_P125[Out-of-Pocket Maximum (OOPM)],\">0\",tbl_OPAOINN_P125[Plan Projected Allowed Amount])","v":0},{"$f":"IFERROR(AV74/AV$75,\"\")","v":""},{"$f":"IF(AND($D$33=\"Yes\",$C$22=\"Office Visits Separate\"),IF(AV74=0,\"Fail\",IF(AW74>=(2/3),AW$45&\" \"&AU74,\"Fail\")),\"N/A\")","v":"N/A"},null,null,null,null,null,"OOPM",{"$f":"SUMIF(tbl_OPOON_P130[Out-of-Pocket Maximum (OOPM)],\">0\",tbl_OPOON_P130[Plan Projected Allowed Amount])","v":0},{"$f":"IFERROR(BE74/BE$75,\"\")","v":""},{"$f":"IF(AND($F$30=\"Yes\",$C$22=\"All Combined\",$C$21=\"Yes\"),IF(BE74=0,\"Fail\",IF(BF74>=(2/3),BF$45&\" \"&BD74,\"Fail\")),\"N/A\")","v":"N/A"},null,null,null,null,null,"OOPM",{"$f":"SUMIF(tbl_OPOVOON_P135[Out-of-Pocket Maximum (OOPM)],\">0\",tbl_OPOVOON_P135[Plan Projected Allowed Amount])","v":0},{"$f":"IFERROR(BN74/BN$75,\"\")","v":""},{"$f":"IF(AND($F$32=\"Yes\",$C$22=\"Office Visits Separate\",$C$21=\"Yes\"),IF(BN74=0,\"Fail\",IF(BO74>=(2/3),BO$45&\" \"&BM74,\"Fail\")),\"N/A\")","v":"N/A"},null,null,null,null,null,"OOPM",{"$f":"SUMIF(tbl_OPAOOON_P140[Out-of-Pocket Maximum (OOPM)],\">0\",tbl_OPAOOON_P140[Plan Projected Allowed Amount])","v":0},{"$f":"IFERROR(BW74/BW$75,\"\")","v":""},{"$f":"IF(AND($F$33=\"Yes\",$C$22=\"Office Visits Separate\",$C$21=\"Yes\"),IF(BW74=0,\"Fail\",IF(BX74>=(2/3),BX$45&\" \"&BV74,\"Fail\")),\"N/A\")","v":"N/A"},null,null,null,null,null,"OOPM",{"$f":"SUMIF(tbl_ER_P145[Out-of-Pocket Maximum (OOPM)],\">0\",tbl_ER_P145[Plan Projected Allowed Amount])","v":0},{"$f":"IFERROR(CF74/CF$75,\"\")","v":""},{"$f":"IF($D$36=\"Yes\",IF(CF74=0,\"Fail\",IF(CG74>=(2/3),CG$45&\" \"&CE74,\"Fail\")),\"N/A\")","v":"N/A"},null,null,null,null,null,"OOPM",{"$f":"SUMIF(tbl_RX_P149[Out-of-Pocket Maximum (OOPM)],\">0\",tbl_RX_P149[Plan Projected Allowed Amount])","v":0},{"$f":"IFERROR(CO74/CO$75,\"\")","v":""},{"$f":"IF($D$37=\"Yes\",IF(CO74=0,\"Fail\",IF(CP74>=(2/3),CP$45&\" \"&CN74,\"Fail\")),\"N/A\")","v":"N/A"}]
[null,null,null,null,null,null,null,null,null,null,"Total Projected",{"$f":"tbl_IPINN_P15[[#Totals],[Plan Projected Allowed Amount]]","v":2285},null,null,null,null,null,null,null,"Total Projected",{"$f":"tbl_IPOON_P110[[#Totals],[Plan Projected Allowed Amount]]","v":759},null,null,null,null,null,null,null,"Total Projected",{"$f":"tbl_OPINN_P115[[#Totals],[Plan Projected Allowed Amount]]","v":0},null,null,null,null,null,null,null,"Total Projected",{"$f":"tbl_OPOVINN_P120[[#Totals],[Plan Projected Allowed Amount]]","v":0},null,null,null,null,null,null,null,"Total Projected",{"$f":"tbl_OPAOINN_P125[[#Totals],[Plan Projected Allowed Amount]]","v":0},null,null,null,null,null,null,null,"Total Projected",{"$f":"tbl_OPOON_P130[[#Totals],[Plan Projected Allowed Amount]]","v":0},null,null,null,null,null,null,null,"Total Projected",{"$f":"tbl_OPOVOON_P135[[#Totals],[Plan Projected Allowed Amount]]","v":0},null,null,null,null,null,null,null,"Total Projected",{"$f":"tbl_OPAOOON_P140[[#Totals],[Plan Projected Allowed Amount]]","v":0},null,null,null,null,null,null,null,"Total Projected",{"$f":"tbl_ER_P145[[#Totals],[Plan Projected Allowed Amount]]","v":0},null,null,null,null,null,null,null,"Total Projected",{"$f":"tbl_RX_P149[[#Totals],[Plan Projected Allowed Amount]]","v":0}]
[]
[null,null,null,null,null,null,null,null,null,null,"Step 2 Predominant Level",null,null,null,null,null,null,null,null,"Step 2 Predominant Level",null,null,null,null,null,null,null,null,"Step 2 Predominant Level",null,null,null,null,null,null,null,null,"Step 2 Predominant Level",null,null,null,null,null,null,null,null,"Step 2 Predominant Level",null,null,null,null,null,null,null,null,"Step 2 Predominant Level",null,null,null,null,null,null,null,null,"Step 2 Predominant Level",null,null,null,null,null,null,null,null,"Step 2 Predominant Level",null,null,null,null,null,null,null,null,"Step 2 Predominant Level",null,null,null,null,null,null,null,null,"Step 2 Predominant Level"]
[null,null,null,null,null,null,null,null,null,null,{"$f":"K82&\" ---- \"&L$40","v":"Deductible ---- (1) Inpatient, In-Network (IP INN)"},null,null,"Errors found:",{"$f":"COUNTIF(tbl_IPINN_P2Ded6[[#Data],[#Totals],[Error Checking]],\"?*\")","v":1},null,null,null,null,{"$f":"T82&\" ---- \"&U$40","v":"Deductible ---- (2) Inpatient, Out-of-Network (IP OON)"},null,null,"Errors found:",{"$f":"COUNTIF(tbl_IPOON_P2Ded11[[#Data],[#Totals],[Error Checking]],\"?*\")","v":0},null,null,null,null,{"$f":"AC82&\" ---- \"&AD$40","v":"Deductible ---- (3) Outpatient, In-Network (OP INN)"},null,null,"Errors found:",{"$f":"COUNTIF(tbl_OPINN_P2Ded16[[#Data],[#Totals],[Error Checking]],\"?*\")","v":0},null,null,null,null,{"$f":"AL82&\" ---- \"&AM$40","v":"Deductible ---- (3a) Outpatient - Office Visits, In-Network (OP-OV INN)"},null,null,"Errors found:",{"$f":"COUNTIF(tbl_OPOVINN_P2Ded21[[#Data],[#Totals],[Error Checking]],\"?*\")","v":0},null,null,null,null,{"$f":"AU82&\" ---- \"&AV$40","v":"Deductible ---- (3b) Outpatient - All Other, In-Network (OP-AO INN)"},null,null,"Errors found:",{"$f":"COUNTIF(tbl_OPAOINN_P2Ded26[[#Data],[#Totals],[Error Checking]],\"?*\")","v":0},null,null,null,null,{"$f":"BD82&\" ---- \"&BE$40","v":"Deductible ---- (4) Outpatient, Out-of-Network (OP OON)"},null,null,"Errors found:",{"$f":"COUNTIF(tbl_OPOON_P2Ded31[[#Data],[#Totals],[Error Checking]],\"?*\")","v":0},null,null,null,null,{"$f":"BM82&\" ---- \"&BN$40","v":"Deductible ---- (4a) Outpatient - Office Visits, Out-of-Network (OP-OV OON)"},null,null,"Errors found:",{"$f":"COUNTIF(tbl_OPOVOON_P2Ded36[[#Data],[#Totals],[Error Checking]],\"?*\")","v":0},null,null,null,null,{"$f":"BV82&\" ---- \"&BW$40","v":"Deductible ---- (4b) Outpatient - All Other, Out-of-Network (OP-AO OON)"},null,null,"Errors found:",{"$f":"COUNTIF(tbl_OPAOOON_P2Ded41[[#Data],[#Totals],[Error Checking]],\"?*\")","v":0},null,null,null,null,{"$f":"CE82&\" ---- \"&CF$40","v":"Deductible ---- (5) Emergency Care,  (ER )"},null,null,"Errors found:",{"$f":"COUNTIF(tbl_ER_P2Ded54[[#Data],[#Totals],[Error Checking]],\"?*\")","v":0},null,null,null,null,{"$f":"CN82&\" ---- \"&CO$40","v":"Deductible ---- (6) Prescription Drugs,  (RX )"},null,null,"Errors found:",{"$f":"COUNTIF(tbl_RX_P2Ded50[[#Data],[#Totals],[Error Checking]],\"?*\")","v":0}]
[null,null,null,null,null,null,null,null,null,null,{"$f":"IF(INDEX(M$71:M$74,MATCH(K82,K$71:K$74,0))=\"\",\"If testing is required for this benefit classification: \nPlease ensure each different cost-share combination is entered above in PART 1.\",IF(INDEX(M$71:M$74,MATCH(K82,K$71:K$74,0))>=(2/3),\"Applies to substantially all medical/surgical benefits in this classification.\nENTER different \"&LOWER(K82)&\" amounts from smallest to largest.\",\"Does not apply to substantially all medical/surgical benefits in this classification. \nDELETE any values in the left-hand column below.\"))","v":"Applies to substantially all medical/surgical benefits in this classification.\nENTER different deductible amounts from smallest to largest."},null,null,null,null,null,null,null,null,{"$f":"IF(INDEX(V$71:V$74,MATCH(T82,T$71:T$74,0))=\"\",\"If testing is required for this benefit classification: \nPlease ensure each different cost-share combination is entered above in PART 1.\",IF(INDEX(V$71:V$74,MATCH(T82,T$71:T$74,0))>=(2/3),\"Applies to substantially all medical/surgical benefits in this classification.\nENTER different \"&LOWER(T82)&\" amounts from smallest to largest.\",\"Does not apply to substantially all medical/surgical benefits in this classification. \nDELETE any values in the left-hand column below.\"))","v":"Applies to substantially all medical/surgical benefits in this classification.\nENTER different deductible amounts from smallest to largest."},null,null,null,null,null,null,null,null,{"$f":"IF(INDEX(AE$71:AE$74,MATCH(AC82,AC$71:AC$74,0))=\"\",\"If testing is required for this benefit classification: \nPlease ensure each different cost-share combination is entered above in PART 1.\",IF(INDEX(AE$71:AE$74,MATCH(AC82,AC$71:AC$74,0))>=(2/3),\"Applies to substantially all medical/surgical benefits in this classification.\nENTER different \"&LOWER(AC82)&\" amounts from smallest to largest.\",\"Does not apply to substantially all medical/surgical benefits in this classification. \nDELETE any values in the left-hand column below.\"))","v":"If testing is required for this benefit classification: \nPlease ensure each different cost-share combination is entered above in PART 1."},null,null,null,null,null,null,null,null,{"$f":"IF(INDEX(AN$71:AN$74,MATCH(AL82,AL$71:AL$74,0))=\"\",\"If testing is required for this benefit classification: \nPlease ensure each different cost-share combination is entered above in PART 1.\",IF(INDEX(AN$71:AN$74,MATCH(AL82,AL$71:AL$74,0))>=(2/3),\"Applies to substantially all medical/surgical benefits in this classification.\nENTER different \"&LOWER(AL82)&\" amounts from smallest to largest.\",\"Does not apply to substantially all medical/surgical benefits in this classification. \nDELETE any values in the left-hand column below.\"))","v":"If testing is required for this benefit classification: \nPlease ensure each different cost-share combination is entered above in PART 1."},null,null,null,null,null,null,null,null,{"$f":"IF(INDEX(AW$71:AW$74,MATCH(AU82,AU$71:AU$74,0))=\"\",\"If testing is required for this benefit classification: \nPlease ensure each different cost-share combination is entered above in PART 1.\",IF(INDEX(AW$71:AW$74,MATCH(AU82,AU$71:AU$74,0))>=(2/3),\"Applies to substantially all medical/surgical benefits in this classification.\nENTER different \"&LOWER(AU82)&\" amounts from smallest to largest.\",\"Does not apply to substantially all medical/surgical benefits in this classification. \nDELETE any values in the left-hand column below.\"))","v":"If testing is required for this benefit classification: \nPlease ensure each different cost-share combination is entered above in PART 1."},null,null,null,null,null,null,null,null,{"$f":"IF(INDEX(BF$71:BF$74,MATCH(BD82,BD$71:BD$74,0))=\"\",\"If testing is required for this benefit classification: \nPlease ensure each different cost-share combination is entered above in PART 1.\",IF(INDEX(BF$71:BF$74,MATCH(BD82,BD$71:BD$74,0))>=(2/3),\"Applies to substantially all medical/surgical benefits in this classification.\nENTER different \"&LOWER(BD82)&\" amounts from smallest to largest.\",\"Does not apply to substantially all medical/surgical benefits in this classification. \nDELETE any values in the left-hand column below.\"))","v":"If testing is required for this benefit classification: \nPlease ensure each different cost-share combination is entered above in PART 1."},null,null,null,null,null,null,null,null,{"$f":"IF(INDEX(BO$71:BO$74,MATCH(BM82,BM$71:BM$74,0))=\"\",\"If testing is required for this benefit classification: \nPlease ensure each different cost-share combination is entered above in PART 1.\",IF(INDEX(BO$71:BO$74,MATCH(BM82,BM$71:BM$74,0))>=(2/3),\"Applies to substantially all medical/surgical benefits in this classification.\nENTER different \"&LOWER(BM82)&\" amounts from smallest to largest.\",\"Does not apply to substantially all medical/surgical benefits in this classification. \nDELETE any values in the left-hand column below.\"))","v":"If testing is required for this benefit classification: \nPlease ensure each different cost-share combination is entered above in PART 1."},null,null,null,null,null,null,null,null,{"$f":"IF(INDEX(BX$71:BX$74,MATCH(BV82,BV$71:BV$74,0))=\"\",\"If testing is required for this benefit classification: \nPlease ensure each different cost-share combination is entered above in PART 1.\",IF(INDEX(BX$71:BX$74,MATCH(BV82,BV$71:BV$74,0))>=(2/3),\"Applies to substantially all medical/surgical benefits in this classification.\nENTER different \"&LOWER(BV82)&\" amounts from smallest to largest.\",\"Does not apply to substantially all medical/surgical benefits in this classification. \nDELETE any values in the left-hand column below.\"))","v":"If testing is required for this benefit classification: \nPlease ensure each different cost-share combination is entered above in PART 1."},null,null,null,null,null,null,null,null,{"$f":"IF(INDEX(CG$71:CG$74,MATCH(CE82,CE$71:CE$74,0))=\"\",\"If testing is required for this benefit classification: \nPlease ensure each different cost-share combination is entered above in PART 1.\",IF(INDEX(CG$71:CG$74,MATCH(CE82,CE$71:CE$74,0))>=(2/3),\"Applies to substantially all medical/surgical benefits in this classification.\nENTER different \"&LOWER(CE82)&\" amounts from smallest to largest.\",\"Does not apply to substantially all medical/surgical benefits in this classification. \nDELETE any values in the left-hand column below.\"))","v":"If testing is required for this benefit classification: \nPlease ensure each different cost-share combination is entered above in PART 1."},null,null,null,null,null,null,null,null,{"$f":"IF(INDEX(CP$71:CP$74,MATCH(CN82,CN$71:CN$74,0))=\"\",\"If testing is required for this benefit classification: \nPlease ensure each different cost-share combination is entered above in PART 1.\",IF(INDEX(CP$71:CP$74,MATCH(CN82,CN$71:CN$74,0))>=(2/3),\"Applies to substantially all medical/surgical benefits in this classification.\nENTER different \"&LOWER(CN82)&\" amounts from smallest to largest.\",\"Does not apply to substantially all medical/surgical benefits in this classification. \nDELETE any values in the left-hand column below.\"))","v":"If testing is required for this benefit classification: \nPlease ensure each different cost-share combination is entered above in PART 1."}]
[]
[]
[null,null,null,null,null,null,null,null,null,null,"Deductible","Allowed Claims","Portion","Predominant & Smaller","Error Checking",null,null,null,null,"Deductible","Allowed Claims","Portion","Predominant & Smaller","Error Checking",null,null,null,null,"Deductible","Allowed Claims","Portion","Predominant & Smaller","Error Checking",null,null,null,null,"Deductible","Allowed Claims","Portion","Predominant & Smaller","Error Checking",null,null,null,null,"Deductible","Allowed Claims","Portion","Predominant & Smaller","Error Checking",null,null,null,null,"Deductible","Allowed Claims","Portion","Predominant & Smaller","Error Checking",null,null,null,null,"Deductible","Allowed Claims","Portion","Predominant & Smaller","Error Checking",null,null,null,null,"Deductible","Allowed Claims","Portion","Predominant & Smaller","Error Checking",null,null,null,null,"Deductible","Allowed Claims","Portion","Predominant & Smaller","Error Checking",null,null,null,null,"Deductible","Allowed Claims","Portion","Predominant & Smaller","Error Checking"]
[null,null,null,null,null,null,null,null,null,null,0,{"$f":"SUMIF(tbl_IPINN_P15[Deductible],K83,tbl_IPINN_P15[Plan Projected Allowed Amount])","v":0},{"$f":"IF(OR(L83=0,L83=\"\"),\"\",L83/tbl_IPINN_P2Ded6[[#Totals],[Allowed Claims]])","v":""},{"$f":"IF(M83=\"\",\"\",IF(SUMIF(tbl_IPINN_P2Ded6[Deductible],\">=\"&K83,tbl_IPINN_P2Ded6[Portion])>0.5,K83,\"\"))","v":""},{"$f":"IF(COUNTIF(tbl_IPINN_P2Ded6[Deductible],tbl_IPINN_P2Ded6[[#This Row],[Deductible]])>1,\"Remove Duplicate Entry.\",IF(AND(tbl_IPINN_P2Ded6[[#This Row],[Deductible]]<>\"\",tbl_IPINN_P2Ded6[[#This Row],[Allowed Claims]]=0),\"Entry not found in Part 1 Table\",IF(AND(OFFSET(tbl_IPINN_P2Ded6[[#This Row],[Deductible]],1,0)<>\"Total\",OFFSET(tbl_IPINN_P2Ded6[[#This Row],[Deductible]],1,0)<>\"\",OFFSET(tbl_IPINN_P2Ded6[[#This Row],[Deductible]],1,0)<tbl_IPINN_P2Ded6[[#This Row],[Deductible]]),\"Sort Entries from lowest to highest\",\"\")))","v":"Entry not found in Part 1 Table"},null,null,null,null,500,{"$f":"SUMIF(tbl_IPOON_P110[Deductible],T83,tbl_IPOON_P110[Plan Projected Allowed Amount])","v":359},{"$f":"IF(OR(U83=0,U83=\"\"),\"\",U83/tbl_IPOON_P2Ded11[[#Totals],[Allowed Claims]])","v":0.54476479514415777},{"$f":"IF(V83=\"\",\"\",IF(SUMIF(tbl_IPOON_P2Ded11[Deductible],\">=\"&T83,tbl_IPOON_P2Ded11[Portion])>0.5,T83,\"\"))","v":500},{"$f":"IF(COUNTIF(tbl_IPOON_P2Ded11[Deductible],tbl_IPOON_P2Ded11[[#This Row],[Deductible]])>1,\"Remove Duplicate Entry.\",IF(AND(tbl_IPOON_P2Ded11[[#This Row],[Deductible]]<>\"\",tbl_IPOON_P2Ded11[[#This Row],[Allowed Claims]]=0),\"Entry not found in Part 1 Table\",IF(AND(OFFSET(tbl_IPOON_P2Ded11[[#This Row],[Deductible]],1,0)<>\"Total\",OFFSET(tbl_IPOON_P2Ded11[[#This Row],[Deductible]],1,0)<>\"\",OFFSET(tbl_IPOON_P2Ded11[[#This Row],[Deductible]],1,0)<tbl_IPOON_P2Ded11[[#This Row],[Deductible]]),\"Sort Entries from lowest to highest\",\"\")))","v":""},null,null,null,null,null,{"$f":"SUMIF(tbl_OPINN_P115[Deductible],AC83,tbl_OPINN_P115[Plan Projected Allowed Amount])","v":0},{"$f":"IF(OR(AD83=0,AD83=\"\"),\"\",AD83/tbl_OPINN_P2Ded16[[#Totals],[Allowed Claims]])","v":""},{"$f":"IF(AE83=\"\",\"\",IF(SUMIF(tbl_OPINN_P2Ded16[Deductible],\">=\"&AC83,tbl_OPINN_P2Ded16[Portion])>0.5,AC83,\"\"))","v":""},{"$f":"IF(COUNTIF(tbl_OPINN_P2Ded16[Deductible],tbl_OPINN_P2Ded16[[#This Row],[Deductible]])>1,\"Remove Duplicate Entry.\",IF(AND(tbl_OPINN_P2Ded16[[#This Row],[Deductible]]<>\"\",tbl_OPINN_P2Ded16[[#This Row],[Allowed Claims]]=0),\"Entry not found in Part 1 Table\",IF(AND(OFFSET(tbl_OPINN_P2Ded16[[#This Row],[Deductible]],1,0)<>\"Total\",OFFSET(tbl_OPINN_P2Ded16[[#This Row],[Deductible]],1,0)<>\"\",OFFSET(tbl_OPINN_P2Ded16[[#This Row],[Deductible]],1,0)<tbl_OPINN_P2Ded16[[#This Row],[Deductible]]),\"Sort Entries from lowest to highest\",\"\")))","v":""},null,null,null,null,null,{"$f":"SUMIF(tbl_OPOVINN_P120[Deductible],AL83,tbl_OPOVINN_P120[Plan Projected Allowed Amount])","v":0},{"$f":"IF(OR(AM83=0,AM83=\"\"),\"\",AM83/tbl_OPOVINN_P2Ded21[[#Totals],[Allowed Claims]])","v":""},{"$f":"IF(AN83=\"\",\"\",IF(SUMIF(tbl_OPOVINN_P2Ded21[Deductible],\">=\"&AL83,tbl_OPOVINN_P2Ded21[Portion])>0.5,AL83,\"\"))","v":""},{"$f":"IF(COUNTIF(tbl_OPOVINN_P2Ded21[Deductible],tbl_OPOVINN_P2Ded21[[#This Row],[Deductible]])>1,\"Remove Duplicate Entry.\",IF(AND(tbl_OPOVINN_P2Ded21[[#This Row],[Deductible]]<>\"\",tbl_OPOVINN_P2Ded21[[#This Row],[Allowed Claims]]=0),\"Entry not found in Part 1 Table\",IF(AND(OFFSET(tbl_OPOVINN_P2Ded21[[#This Row],[Deductible]],1,0)<>\"Total\",OFFSET(tbl_OPOVINN_P2Ded21[[#This Row],[Deductible]],1,0)<>\"\",OFFSET(tbl_OPOVINN_P2Ded21[[#This Row],[Deductible]],1,0)<tbl_OPOVINN_P2Ded21[[#This Row],[Deductible]]),\"Sort Entries from lowest to highest\",\"\")))","v":""},null,null,null,null,null,{"$f":"SUMIF(tbl_OPAOINN_P125[Deductible],AU83,tbl_OPAOINN_P125[Plan Projected Allowed Amount])","v":0},{"$f":"IF(OR(AV83=0,AV83=\"\"),\"\",AV83/tbl_OPAOINN_P2Ded26[[#Totals],[Allowed Claims]])","v":""},{"$f":"IF(AW83=\"\",\"\",IF(SUMIF(tbl_OPAOINN_P2Ded26[Deductible],\">=\"&AU83,tbl_OPAOINN_P2Ded26[Portion])>0.5,AU83,\"\"))","v":""},{"$f":"IF(COUNTIF(tbl_OPAOINN_P2Ded26[Deductible],tbl_OPAOINN_P2Ded26[[#This Row],[Deductible]])>1,\"Remove Duplicate Entry.\",IF(AND(tbl_OPAOINN_P2Ded26[[#This Row],[Deductible]]<>\"\",tbl_OPAOINN_P2Ded26[[#This Row],[Allowed Claims]]=0),\"Entry not found in Part 1 Table\",IF(AND(OFFSET(tbl_OPAOINN_P2Ded26[[#This Row],[Deductible]],1,0)<>\"Total\",OFFSET(tbl_OPAOINN_P2Ded26[[#This Row],[Deductible]],1,0)<>\"\",OFFSET(tbl_OPAOINN_P2Ded26[[#This Row],[Deductible]],1,0)<tbl_OPAOINN_P2Ded26[[#This Row],[Deductible]]),\"Sort Entries from lowest to highest\",\"\")))","v":""},null,null,null,null,null,{"$f":"SUMIF(tbl_OPOON_P130[Deductible],BD83,tbl_OPOON_P130[Plan Projected Allowed Amount])","v":0},{"$f":"IF(OR(BE83=0,BE83=\"\"),\"\",BE83/tbl_OPOON_P2Ded31[[#Totals],[Allowed Claims]])","v":""},{"$f":"IF(BF83=\"\",\"\",IF(SUMIF(tbl_OPOON_P2Ded31[Deductible],\">=\"&BD83,tbl_OPOON_P2Ded31[Portion])>0.5,BD83,\"\"))","v":""},{"$f":"IF(COUNTIF(tbl_OPOON_P2Ded31[Deductible],tbl_OPOON_P2Ded31[[#This Row],[Deductible]])>1,\"Remove Duplicate Entry.\",IF(AND(tbl_OPOON_P2Ded31[[#This Row],[Deductible]]<>\"\",tbl_OPOON_P2Ded31[[#This Row],[Allowed Claims]]=0),\"Entry not found in Part 1 Table\",IF(AND(OFFSET(tbl_OPOON_P2Ded31[[#This Row],[Deductible]],1,0)<>\"Total\",OFFSET(tbl_OPOON_P2Ded31[[#This Row],[Deductible]],1,0)<>\"\",OFFSET(tbl_OPOON_P2Ded31[[#This Row],[Deductible]],1,0)<tbl_OPOON_P2Ded31[[#This Row],[Deductible]]),\"Sort Entries from lowest to highest\",\"\")))","v":""},null,null,null,null,null,{"$f":"SUMIF(tbl_OPOVOON_P135[Deductible],BM83,tbl_OPOVOON_P135[Plan Projected Allowed Amount])","v":0},{"$f":"IF(OR(BN83=0,BN83=\"\"),\"\",BN83/tbl_OPOVOON_P2Ded36[[#Totals],[Allowed Claims]])","v":""},{"$f":"IF(BO83=\"\",\"\",IF(SUMIF(tbl_OPOVOON_P2Ded36[Deductible],\">=\"&BM83,tbl_OPOVOON_P2Ded36[Portion])>0.5,BM83,\"\"))","v":""},{"$f":"IF(COUNTIF(tbl_OPOVOON_P2Ded36[Deductible],tbl_OPOVOON_P2Ded36[[#This Row],[Deductible]])>1,\"Remove Duplicate Entry.\",IF(AND(tbl_OPOVOON_P2Ded36[[#This Row],[Deductible]]<>\"\",tbl_OPOVOON_P2Ded36[[#This Row],[Allowed Claims]]=0),\"Entry not found in Part 1 Table\",IF(AND(OFFSET(tbl_OPOVOON_P2Ded36[[#This Row],[Deductible]],1,0)<>\"Total\",OFFSET(tbl_OPOVOON_P2Ded36[[#This Row],[Deductible]],1,0)<>\"\",OFFSET(tbl_OPOVOON_P2Ded36[[#This Row],[Deductible]],1,0)<tbl_OPOVOON_P2Ded36[[#This Row],[Deductible]]),\"Sort Entries from lowest to highest\",\"\")))","v":""},null,null,null,null,null,{"$f":"SUMIF(tbl_OPAOOON_P140[Deductible],BV83,tbl_OPAOOON_P140[Plan Projected Allowed Amount])","v":0},{"$f":"IF(OR(BW83=0,BW83=\"\"),\"\",BW83/tbl_OPAOOON_P2Ded41[[#Totals],[Allowed Claims]])","v":""},{"$f":"IF(BX83=\"\",\"\",IF(SUMIF(tbl_OPAOOON_P2Ded41[Deductible],\">=\"&BV83,tbl_OPAOOON_P2Ded41[Portion])>0.5,BV83,\"\"))","v":""},{"$f":"IF(COUNTIF(tbl_OPAOOON_P2Ded41[Deductible],tbl_OPAOOON_P2Ded41[[#This Row],[Deductible]])>1,\"Remove Duplicate Entry.\",IF(AND(tbl_OPAOOON_P2Ded41[[#This Row],[Deductible]]<>\"\",tbl_OPAOOON_P2Ded41[[#This Row],[Allowed Claims]]=0),\"Entry not found in Part 1 Table\",IF(AND(OFFSET(tbl_OPAOOON_P2Ded41[[#This Row],[Deductible]],1,0)<>\"Total\",OFFSET(tbl_OPAOOON_P2Ded41[[#This Row],[Deductible]],1,0)<>\"\",OFFSET(tbl_OPAOOON_P2Ded41[[#This Row],[Deductible]],1,0)<tbl_OPAOOON_P2Ded41[[#This Row],[Deductible]]),\"Sort Entries from lowest to highest\",\"\")))","v":""},null,null,null,null,null,{"$f":"SUMIF(tbl_ER_P145[Deductible],CE83,tbl_ER_P145[Plan Projected Allowed Amount])","v":0},{"$f":"IF(OR(CF83=0,CF83=\"\"),\"\",CF83/tbl_ER_P2Ded54[[#Totals],[Allowed Claims]])","v":""},{"$f":"IF(CG83=\"\",\"\",IF(SUMIF(tbl_ER_P2Ded54[Deductible],\">=\"&CE83,tbl_ER_P2Ded54[Portion])>0.5,CE83,\"\"))","v":""},{"$f":"IF(COUNTIF(tbl_ER_P2Ded54[Deductible],tbl_ER_P2Ded54[[#This Row],[Deductible]])>1,\"Remove Duplicate Entry.\",IF(AND(tbl_ER_P2Ded54[[#This Row],[Deductible]]<>\"\",tbl_ER_P2Ded54[[#This Row],[Allowed Claims]]=0),\"Entry not found in Part 1 Table\",IF(AND(OFFSET(tbl_ER_P2Ded54[[#This Row],[Deductible]],1,0)<>\"Total\",OFFSET(tbl_ER_P2Ded54[[#This Row],[Deductible]],1,0)<>\"\",OFFSET(tbl_ER_P2Ded54[[#This Row],[Deductible]],1,0)<tbl_ER_P2Ded54[[#This Row],[Deductible]]),\"Sort Entries from lowest to highest\",\"\")))","v":""},null,null,null,null,null,{"$f":"SUMIF(tbl_RX_P149[Deductible],CN83,tbl_RX_P149[Plan Projected Allowed Amount])","v":0},{"$f":"IF(OR(CO83=0,CO83=\"\"),\"\",CO83/tbl_RX_P2Ded50[[#Totals],[Allowed Claims]])","v":""},{"$f":"IF(CP83=\"\",\"\",IF(SUMIF(tbl_RX_P2Ded50[Deductible],\">=\"&CN83,tbl_RX_P2Ded50[Portion])>0.5,CN83,\"\"))","v":""},{"$f":"IF(COUNTIF(tbl_RX_P2Ded50[Deductible],tbl_RX_P2Ded50[[#This Row],[Deductible]])>1,\"Remove Duplicate Entry.\",IF(AND(tbl_RX_P2Ded50[[#This Row],[Deductible]]<>\"\",tbl_RX_P2Ded50[[#This Row],[Allowed Claims]]=0),\"Entry not found in Part 1 Table\",IF(AND(OFFSET(tbl_RX_P2Ded50[[#This Row],[Deductible]],1,0)<>\"Total\",OFFSET(tbl_RX_P2Ded50[[#This Row],[Deductible]],1,0)<>\"\",OFFSET(tbl_RX_P2Ded50[[#This Row],[Deductible]],1,0)<tbl_RX_P2Ded50[[#This Row],[Deductible]]),\"Sort Entries from lowest to highest\",\"\")))","v":""}]
[null,null,null,null,null,null,null,null,null,null,500,{"$f":"SUMIF(tbl_IPINN_P15[Deductible],K84,tbl_IPINN_P15[Plan Projected Allowed Amount])","v":1939},{"$f":"IF(OR(L84=0,L84=\"\"),\"\",L84/tbl_IPINN_P2Ded6[[#Totals],[Allowed Claims]])","v":1},{"$f":"IF(M84=\"\",\"\",IF(SUMIF(tbl_IPINN_P2Ded6[Deductible],\">=\"&K84,tbl_IPINN_P2Ded6[Portion])>0.5,K84,\"\"))","v":500},{"$f":"IF(COUNTIF(tbl_IPINN_P2Ded6[Deductible],tbl_IPINN_P2Ded6[[#This Row],[Deductible]])>1,\"Remove Duplicate Entry.\",IF(AND(tbl_IPINN_P2Ded6[[#This Row],[Deductible]]<>\"\",tbl_IPINN_P2Ded6[[#This Row],[Allowed Claims]]=0),\"Entry not found in Part 1 Table\",IF(AND(OFFSET(tbl_IPINN_P2Ded6[[#This Row],[Deductible]],1,0)<>\"Total\",OFFSET(tbl_IPINN_P2Ded6[[#This Row],[Deductible]],1,0)<>\"\",OFFSET(tbl_IPINN_P2Ded6[[#This Row],[Deductible]],1,0)<tbl_IPINN_P2Ded6[[#This Row],[Deductible]]),\"Sort Entries from lowest to highest\",\"\")))","v":""},null,null,null,null,550,{"$f":"SUMIF(tbl_IPOON_P110[Deductible],T84,tbl_IPOON_P110[Plan Projected Allowed Amount])","v":300},{"$f":"IF(OR(U84=0,U84=\"\"),\"\",U84/tbl_IPOON_P2Ded11[[#Totals],[Allowed Claims]])","v":0.45523520485584218},{"$f":"IF(V84=\"\",\"\",IF(SUMIF(tbl_IPOON_P2Ded11[Deductible],\">=\"&T84,tbl_IPOON_P2Ded11[Portion])>0.5,T84,\"\"))","v":""},{"$f":"IF(COUNTIF(tbl_IPOON_P2Ded11[Deductible],tbl_IPOON_P2Ded11[[#This Row],[Deductible]])>1,\"Remove Duplicate Entry.\",IF(AND(tbl_IPOON_P2Ded11[[#This Row],[Deductible]]<>\"\",tbl_IPOON_P2Ded11[[#This Row],[Allowed Claims]]=0),\"Entry not found in Part 1 Table\",IF(AND(OFFSET(tbl_IPOON_P2Ded11[[#This Row],[Deductible]],1,0)<>\"Total\",OFFSET(tbl_IPOON_P2Ded11[[#This Row],[Deductible]],1,0)<>\"\",OFFSET(tbl_IPOON_P2Ded11[[#This Row],[Deductible]],1,0)<tbl_IPOON_P2Ded11[[#This Row],[Deductible]]),\"Sort Entries from lowest to highest\",\"\")))","v":""},null,null,null,null,null,{"$f":"SUMIF(tbl_OPINN_P115[Deductible],AC84,tbl_OPINN_P115[Plan Projected Allowed Amount])","v":0},{"$f":"IF(OR(AD84=0,AD84=\"\"),\"\",AD84/tbl_OPINN_P2Ded16[[#Totals],[Allowed Claims]])","v":""},{"$f":"IF(AE84=\"\",\"\",IF(SUMIF(tbl_OPINN_P2Ded16[Deductible],\">=\"&AC84,tbl_OPINN_P2Ded16[Portion])>0.5,AC84,\"\"))","v":""},{"$f":"IF(COUNTIF(tbl_OPINN_P2Ded16[Deductible],tbl_OPINN_P2Ded16[[#This Row],[Deductible]])>1,\"Remove Duplicate Entry.\",IF(AND(tbl_OPINN_P2Ded16[[#This Row],[Deductible]]<>\"\",tbl_OPINN_P2Ded16[[#This Row],[Allowed Claims]]=0),\"Entry not found in Part 1 Table\",IF(AND(OFFSET(tbl_OPINN_P2Ded16[[#This Row],[Deductible]],1,0)<>\"Total\",OFFSET(tbl_OPINN_P2Ded16[[#This Row],[Deductible]],1,0)<>\"\",OFFSET(tbl_OPINN_P2Ded16[[#This Row],[Deductible]],1,0)<tbl_OPINN_P2Ded16[[#This Row],[Deductible]]),\"Sort Entries from lowest to highest\",\"\")))","v":""},null,null,null,null,null,{"$f":"SUMIF(tbl_OPOVINN_P120[Deductible],AL84,tbl_OPOVINN_P120[Plan Projected Allowed Amount])","v":0},{"$f":"IF(OR(AM84=0,AM84=\"\"),\"\",AM84/tbl_OPOVINN_P2Ded21[[#Totals],[Allowed Claims]])","v":""},{"$f":"IF(AN84=\"\",\"\",IF(SUMIF(tbl_OPOVINN_P2Ded21[Deductible],\">=\"&AL84,tbl_OPOVINN_P2Ded21[Portion])>0.5,AL84,\"\"))","v":""},{"$f":"IF(COUNTIF(tbl_OPOVINN_P2Ded21[Deductible],tbl_OPOVINN_P2Ded21[[#This Row],[Deductible]])>1,\"Remove Duplicate Entry.\",IF(AND(tbl_OPOVINN_P2Ded21[[#This Row],[Deductible]]<>\"\",tbl_OPOVINN_P2Ded21[[#This Row],[Allowed Claims]]=0),\"Entry not found in Part 1 Table\",IF(AND(OFFSET(tbl_OPOVINN_P2Ded21[[#This Row],[Deductible]],1,0)<>\"Total\",OFFSET(tbl_OPOVINN_P2Ded21[[#This Row],[Deductible]],1,0)<>\"\",OFFSET(tbl_OPOVINN_P2Ded21[[#This Row],[Deductible]],1,0)<tbl_OPOVINN_P2Ded21[[#This Row],[Deductible]]),\"Sort Entries from lowest to highest\",\"\")))","v":""},null,null,null,null,null,{"$f":"SUMIF(tbl_OPAOINN_P125[Deductible],AU84,tbl_OPAOINN_P125[Plan Projected Allowed Amount])","v":0},{"$f":"IF(OR(AV84=0,AV84=\"\"),\"\",AV84/tbl_OPAOINN_P2Ded26[[#Totals],[Allowed Claims]])","v":""},{"$f":"IF(AW84=\"\",\"\",IF(SUMIF(tbl_OPAOINN_P2Ded26[Deductible],\">=\"&AU84,tbl_OPAOINN_P2Ded26[Portion])>0.5,AU84,\"\"))","v":""},{"$f":"IF(COUNTIF(tbl_OPAOINN_P2Ded26[Deductible],tbl_OPAOINN_P2Ded26[[#This Row],[Deductible]])>1,\"Remove Duplicate Entry.\",IF(AND(tbl_OPAOINN_P2Ded26[[#This Row],[Deductible]]<>\"\",tbl_OPAOINN_P2Ded26[[#This Row],[Allowed Claims]]=0),\"Entry not found in Part 1 Table\",IF(AND(OFFSET(tbl_OPAOINN_P2Ded26[[#This Row],[Deductible]],1,0)<>\"Total\",OFFSET(tbl_OPAOINN_P2Ded26[[#This Row],[Deductible]],1,0)<>\"\",OFFSET(tbl_OPAOINN_P2Ded26[[#This Row],[Deductible]],1,0)<tbl_OPAOINN_P2Ded26[[#This Row],[Deductible]]),\"Sort Entries from lowest to highest\",\"\")))","v":""},null,null,null,null,null,{"$f":"SUMIF(tbl_OPOON_P130[Deductible],BD84,tbl_OPOON_P130[Plan Projected Allowed Amount])","v":0},{"$f":"IF(OR(BE84=0,BE84=\"\"),\"\",BE84/tbl_OPOON_P2Ded31[[#Totals],[Allowed Claims]])","v":""},{"$f":"IF(BF84=\"\",\"\",IF(SUMIF(tbl_OPOON_P2Ded31[Deductible],\">=\"&BD84,tbl_OPOON_P2Ded31[Portion])>0.5,BD84,\"\"))","v":""},{"$f":"IF(COUNTIF(tbl_OPOON_P2Ded31[Deductible],tbl_OPOON_P2Ded31[[#This Row],[Deductible]])>1,\"Remove Duplicate Entry.\",IF(AND(tbl_OPOON_P2Ded31[[#This Row],[Deductible]]<>\"\",tbl_OPOON_P2Ded31[[#This Row],[Allowed Claims]]=0),\"Entry not found in Part 1 Table\",IF(AND(OFFSET(tbl_OPOON_P2Ded31[[#This Row],[Deductible]],1,0)<>\"Total\",OFFSET(tbl_OPOON_P2Ded31[[#This Row],[Deductible]],1,0)<>\"\",OFFSET(tbl_OPOON_P2Ded31[[#This Row],[Deductible]],1,0)<tbl_OPOON_P2Ded31[[#This Row],[Deductible]]),\"Sort Entries from lowest to highest\",\"\")))","v":""},null,null,null,null,null,{"$f":"SUMIF(tbl_OPOVOON_P135[Deductible],BM84,tbl_OPOVOON_P135[Plan Projected Allowed Amount])","v":0},{"$f":"IF(OR(BN84=0,BN84=\"\"),\"\",BN84/tbl_OPOVOON_P2Ded36[[#Totals],[Allowed Claims]])","v":""},{"$f":"IF(BO84=\"\",\"\",IF(SUMIF(tbl_OPOVOON_P2Ded36[Deductible],\">=\"&BM84,tbl_OPOVOON_P2Ded36[Portion])>0.5,BM84,\"\"))","v":""},{"$f":"IF(COUNTIF(tbl_OPOVOON_P2Ded36[Deductible],tbl_OPOVOON_P2Ded36[[#This Row],[Deductible]])>1,\"Remove Duplicate Entry.\",IF(AND(tbl_OPOVOON_P2Ded36[[#This Row],[Deductible]]<>\"\",tbl_OPOVOON_P2Ded36[[#This Row],[Allowed Claims]]=0),\"Entry not found in Part 1 Table\",IF(AND(OFFSET(tbl_OPOVOON_P2Ded36[[#This Row],[Deductible]],1,0)<>\"Total\",OFFSET(tbl_OPOVOON_P2Ded36[[#This Row],[Deductible]],1,0)<>\"\",OFFSET(tbl_OPOVOON_P2Ded36[[#This Row],[Deductible]],1,0)<tbl_OPOVOON_P2Ded36[[#This Row],[Deductible]]),\"Sort Entries from lowest to highest\",\"\")))","v":""},null,null,null,null,null,{"$f":"SUMIF(tbl_OPAOOON_P140[Deductible],BV84,tbl_OPAOOON_P140[Plan Projected Allowed Amount])","v":0},{"$f":"IF(OR(BW84=0,BW84=\"\"),\"\",BW84/tbl_OPAOOON_P2Ded41[[#Totals],[Allowed Claims]])","v":""},{"$f":"IF(BX84=\"\",\"\",IF(SUMIF(tbl_OPAOOON_P2Ded41[Deductible],\">=\"&BV84,tbl_OPAOOON_P2Ded41[Portion])>0.5,BV84,\"\"))","v":""},{"$f":"IF(COUNTIF(tbl_OPAOOON_P2Ded41[Deductible],tbl_OPAOOON_P2Ded41[[#This Row],[Deductible]])>1,\"Remove Duplicate Entry.\",IF(AND(tbl_OPAOOON_P2Ded41[[#This Row],[Deductible]]<>\"\",tbl_OPAOOON_P2Ded41[[#This Row],[Allowed Claims]]=0),\"Entry not found in Part 1 Table\",IF(AND(OFFSET(tbl_OPAOOON_P2Ded41[[#This Row],[Deductible]],1,0)<>\"Total\",OFFSET(tbl_OPAOOON_P2Ded41[[#This Row],[Deductible]],1,0)<>\"\",OFFSET(tbl_OPAOOON_P2Ded41[[#This Row],[Deductible]],1,0)<tbl_OPAOOON_P2Ded41[[#This Row],[Deductible]]),\"Sort Entries from lowest to highest\",\"\")))","v":""},null,null,null,null,null,{"$f":"SUMIF(tbl_ER_P145[Deductible],CE84,tbl_ER_P145[Plan Projected Allowed Amount])","v":0},{"$f":"IF(OR(CF84=0,CF84=\"\"),\"\",CF84/tbl_ER_P2Ded54[[#Totals],[Allowed Claims]])","v":""},{"$f":"IF(CG84=\"\",\"\",IF(SUMIF(tbl_ER_P2Ded54[Deductible],\">=\"&CE84,tbl_ER_P2Ded54[Portion])>0.5,CE84,\"\"))","v":""},{"$f":"IF(COUNTIF(tbl_ER_P2Ded54[Deductible],tbl_ER_P2Ded54[[#This Row],[Deductible]])>1,\"Remove Duplicate Entry.\",IF(AND(tbl_ER_P2Ded54[[#This Row],[Deductible]]<>\"\",tbl_ER_P2Ded54[[#This Row],[Allowed Claims]]=0),\"Entry not found in Part 1 Table\",IF(AND(OFFSET(tbl_ER_P2Ded54[[#This Row],[Deductible]],1,0)<>\"Total\",OFFSET(tbl_ER_P2Ded54[[#This Row],[Deductible]],1,0)<>\"\",OFFSET(tbl_ER_P2Ded54[[#This Row],[Deductible]],1,0)<tbl_ER_P2Ded54[[#This Row],[Deductible]]),\"Sort Entries from lowest to highest\",\"\")))","v":""},null,null,null,null,null,{"$f":"SUMIF(tbl_RX_P149[Deductible],CN84,tbl_RX_P149[Plan Projected Allowed Amount])","v":0},{"$f":"IF(OR(CO84=0,CO84=\"\"),\"\",CO84/tbl_RX_P2Ded50[[#Totals],[Allowed Claims]])","v":""},{"$f":"IF(CP84=\"\",\"\",IF(SUMIF(tbl_RX_P2Ded50[Deductible],\">=\"&CN84,tbl_RX_P2Ded50[Portion])>0.5,CN84,\"\"))","v":""},{"$f":"IF(COUNTIF(tbl_RX_P2Ded50[Deductible],tbl_RX_P2Ded50[[#This Row],[Deductible]])>1,\"Remove Duplicate Entry.\",IF(AND(tbl_RX_P2Ded50[[#This Row],[Deductible]]<>\"\",tbl_RX_P2Ded50[[#This Row],[Allowed Claims]]=0),\"Entry not found in Part 1 Table\",IF(AND(OFFSET(tbl_RX_P2Ded50[[#This Row],[Deductible]],1,0)<>\"Total\",OFFSET(tbl_RX_P2Ded50[[#This Row],[Deductible]],1,0)<>\"\",OFFSET(tbl_RX_P2Ded50[[#This Row],[Deductible]],1,0)<tbl_RX_P2Ded50[[#This Row],[Deductible]]),\"Sort Entries from lowest to highest\",\"\")))","v":""}]
[null,null,null,null,null,null,null,null,null,null,null,{"$f":"SUMIF(tbl_IPINN_P15[Deductible],K85,tbl_IPINN_P15[Plan Projected Allowed Amount])","v":0},{"$f":"IF(OR(L85=0,L85=\"\"),\"\",L85/tbl_IPINN_P2Ded6[[#Totals],[Allowed Claims]])","v":""},{"$f":"IF(M85=\"\",\"\",IF(SUMIF(tbl_IPINN_P2Ded6[Deductible],\">=\"&K85,tbl_IPINN_P2Ded6[Portion])>0.5,K85,\"\"))","v":""},{"$f":"IF(COUNTIF(tbl_IPINN_P2Ded6[Deductible],tbl_IPINN_P2Ded6[[#This Row],[Deductible]])>1,\"Remove Duplicate Entry.\",IF(AND(tbl_IPINN_P2Ded6[[#This Row],[Deductible]]<>\"\",tbl_IPINN_P2Ded6[[#This Row],[Allowed Claims]]=0),\"Entry not found in Part 1 Table\",IF(AND(OFFSET(tbl_IPINN_P2Ded6[[#This Row],[Deductible]],1,0)<>\"Total\",OFFSET(tbl_IPINN_P2Ded6[[#This Row],[Deductible]],1,0)<>\"\",OFFSET(tbl_IPINN_P2Ded6[[#This Row],[Deductible]],1,0)<tbl_IPINN_P2Ded6[[#This Row],[Deductible]]),\"Sort Entries from lowest to highest\",\"\")))","v":""},null,null,null,null,"Total",{"$f":"SUBTOTAL(109,tbl_IPOON_P2Ded11[Allowed Claims])","v":659},{"$f":"SUBTOTAL(109,tbl_IPOON_P2Ded11[Portion])","v":1},null,{"$f":"IF(AND(tbl_IPOON_P2Ded11[[#Totals],[Allowed Claims]]<U71,W71<>\"Fail\",W71<>\"N/A\"),\"Add missing cost share values.\",IF(U85>V57,\"Delete extra row or edit deductible values.\",\"\"))","v":""},null,null,null,null,"Total",{"$f":"SUBTOTAL(109,tbl_OPINN_P2Ded16[Allowed Claims])","v":0},{"$f":"SUBTOTAL(109,tbl_OPINN_P2Ded16[Portion])","v":0},null,{"$f":"IF(AND(tbl_OPINN_P2Ded16[[#Totals],[Allowed Claims]]<AD71,AF71<>\"Fail\",AF71<>\"N/A\"),\"Add missing cost share values.\",IF(AD85>AE55,\"Delete extra row or edit deductible values.\",\"\"))","v":""},null,null,null,null,"Total",{"$f":"SUBTOTAL(109,tbl_OPOVINN_P2Ded21[Allowed Claims])","v":0},{"$f":"SUBTOTAL(109,tbl_OPOVINN_P2Ded21[Portion])","v":0},null,{"$f":"IF(AND(tbl_OPOVINN_P2Ded21[[#Totals],[Allowed Claims]]<AM71,AO71<>\"Fail\",AO71<>\"N/A\"),\"Add missing cost share values.\",IF(AM85>AN55,\"Delete extra row or edit deductible values.\",\"\"))","v":""},null,null,null,null,"Total",{"$f":"SUBTOTAL(109,tbl_OPAOINN_P2Ded26[Allowed Claims])","v":0},{"$f":"SUBTOTAL(109,tbl_OPAOINN_P2Ded26[Portion])","v":0},null,{"$f":"IF(AND(tbl_OPAOINN_P2Ded26[[#Totals],[Allowed Claims]]<AV71,AX71<>\"Fail\",AX71<>\"N/A\"),\"Add missing cost share values.\",IF(AV85>AW55,\"Delete extra row or edit deductible values.\",\"\"))","v":""},null,null,null,null,"Total",{"$f":"SUBTOTAL(109,tbl_OPOON_P2Ded31[Allowed Claims])","v":0},{"$f":"SUBTOTAL(109,tbl_OPOON_P2Ded31[Portion])","v":0},null,{"$f":"IF(AND(tbl_OPOON_P2Ded31[[#Totals],[Allowed Claims]]<BE71,BG71<>\"Fail\",BG71<>\"N/A\"),\"Add missing cost share values.\",IF(BE85>BF55,\"Delete extra row or edit deductible values.\",\"\"))","v":""},null,null,null,null,"Total",{"$f":"SUBTOTAL(109,tbl_OPOVOON_P2Ded36[Allowed Claims])","v":0},{"$f":"SUBTOTAL(109,tbl_OPOVOON_P2Ded36[Portion])","v":0},null,{"$f":"IF(AND(tbl_OPOVOON_P2Ded36[[#Totals],[Allowed Claims]]<BN71,BP71<>\"Fail\",BP71<>\"N/A\"),\"Add missing cost share values.\",IF(BN85>BO55,\"Delete extra row or edit deductible values.\",\"\"))","v":""},null,null,null,null,"Total",{"$f":"SUBTOTAL(109,tbl_OPAOOON_P2Ded41[Allowed Claims])","v":0},{"$f":"SUBTOTAL(109,tbl_OPAOOON_P2Ded41[Portion])","v":0},null,{"$f":"IF(AND(tbl_OPAOOON_P2Ded41[[#Totals],[Allowed Claims]]<BW71,BY71<>\"Fail\",BY71<>\"N/A\"),\"Add missing cost share values.\",IF(BW85>BX55,\"Delete extra row or edit deductible values.\",\"\"))","v":""},null,null,null,null,"Total",{"$f":"SUBTOTAL(109,tbl_ER_P2Ded54[Allowed Claims])","v":0},{"$f":"SUBTOTAL(109,tbl_ER_P2Ded54[Portion])","v":0},null,{"$f":"IF(AND(tbl_ER_P2Ded54[[#Totals],[Allowed Claims]]<CF71,CH71<>\"Fail\",CH71<>\"N/A\"),\"Add missing cost share values.\",IF(CF85>CG55,\"Delete extra row or edit deductible values.\",\"\"))","v":""},null,null,null,null,"Total",{"$f":"SUBTOTAL(109,tbl_RX_P2Ded50[Allowed Claims])","v":0},{"$f":"SUBTOTAL(109,tbl_RX_P2Ded50[Portion])","v":0},null,{"$f":"IF(AND(tbl_RX_P2Ded50[[#Totals],[Allowed Claims]]<CO71,CQ71<>\"Fail\",CQ71<>\"N/A\"),\"Add missing cost share values.\",IF(CO85>CP55,\"Delete extra row or edit deductible values.\",\"\"))","v":""}]
[null,null,null,null,null,null,null,null,null,null,"Total",{"$f":"SUBTOTAL(109,tbl_IPINN_P2Ded6[Allowed Claims])","v":1939},{"$f":"SUBTOTAL(109,tbl_IPINN_P2Ded6[Portion])","v":1},null,{"$f":"IF(AND(tbl_IPINN_P2Ded6[[#Totals],[Allowed Claims]]<L71,N71<>\"Fail\",N71<>\"N/A\"),\"Add missing cost share values.\",IF(L86>M55,\"Delete extra row or edit deductible values.\",\"\"))","v":""}]
[null,null,null,null,null,null,null,null,null,null,null,null,null,null,null,null,null,null,null,{"$f":"T91&\" ---- \"&U$40","v":"Copayment ---- (2) Inpatient, Out-of-Network (IP OON)"},null,null,"Errors found:",{"$f":"COUNTIF(tbl_IPOON_P2Cop12[[#Data],[#Totals],[Error Checking]],\"?*\")","v":0},null,null,null,null,{"$f":"AC91&\" ---- \"&AD$40","v":"Copayment ---- (3) Outpatient, In-Network (OP INN)"},null,null,"Errors found:",{"$f":"COUNTIF(tbl_OPINN_P2Cop17[[#Data],[#Totals],[Error Checking]],\"?*\")","v":0},null,null,null,null,{"$f":"AL91&\" ---- \"&AM$40","v":"Copayment ---- (3a) Outpatient - Office Visits, In-Network (OP-OV INN)"},null,null,"Errors found:",{"$f":"COUNTIF(tbl_OPOVINN_P2Cop22[[#Data],[#Totals],[Error Checking]],\"?*\")","v":0},null,null,null,null,{"$f":"AU91&\" ---- \"&AV$40","v":"Copayment ---- (3b) Outpatient - All Other, In-Network (OP-AO INN)"},null,null,"Errors found:",{"$f":"COUNTIF(tbl_OPAOINN_P2Cop27[[#Data],[#Totals],[Error Checking]],\"?*\")","v":0},null,null,null,null,{"$f":"BD91&\" ---- \"&BE$40","v":"Copayment ---- (4) Outpatient, Out-of-Network (OP OON)"},null,null,"Errors found:",{"$f":"COUNTIF(tbl_OPOON_P2Cop32[[#Data],[#Totals],[Error Checking]],\"?*\")","v":0},null,null,null,null,{"$f":"BM91&\" ---- \"&BN$40","v":"Copayment ---- (4a) Outpatient - Office Visits, Out-of-Network (OP-OV OON)"},null,null,"Errors found:",{"$f":"COUNTIF(tbl_OPOVOON_P2Cop37[[#Data],[#Totals],[Error Checking]],\"?*\")","v":0},null,null,null,null,{"$f":"BV91&\" ---- \"&BW$40","v":"Copayment ---- (4b) Outpatient - All Other, Out-of-Network (OP-AO OON)"},null,null,"Errors found:",{"$f":"COUNTIF(tbl_OPAOOON_P2Cop42[[#Data],[#Totals],[Error Checking]],\"?*\")","v":0},null,null,null,null,{"$f":"CE91&\" ---- \"&CF$40","v":"Copayment ---- (5) Emergency Care,  (ER )"},null,null,"Errors found:",{"$f":"COUNTIF(tbl_ER_P2Cop46[[#Data],[#Totals],[Error Checking]],\"?*\")","v":0},null,null,null,null,{"$f":"CN91&\" ---- \"&CO$40","v":"Copayment ---- (6) Prescription Drugs,  (RX )"},null,null,"Errors found:",{"$f":"COUNTIF(tbl_RX_P2Cop51[[#Data],[#Totals],[Error Checking]],\"?*\")","v":0}]
[null,null,null,null,null,null,null,null,null,null,{"$f":"K92&\" ---- \"&L$40","v":"Copayment ---- (1) Inpatient, In-Network (IP INN)"},null,null,"Errors found:",{"$f":"COUNTIF(tbl_IPINN_P2Cop7[[#Data],[#Totals],[Error Checking]],\"?*\")","v":5},null,null,null,null,{"$f":"IF(INDEX(V$71:V$74,MATCH(T91,T$71:T$74,0))=\"\",\"If testing is required for this benefit classification: \nPlease ensure each different cost-share combination is entered above in PART 1.\",IF(INDEX(V$71:V$74,MATCH(T91,T$71:T$74,0))>=(2/3),\"Applies to substantially all medical/surgical benefits in this classification.\nENTER different \"&LOWER(T91)&\" amounts from smallest to largest.\",\"Does not apply to substantially all medical/surgical benefits in this classification. \nDELETE any values in the left-hand column below.\"))","v":"Applies to substantially all medical/surgical benefits in this classification.\nENTER different copayment amounts from smallest to largest."},null,null,null,null,null,null,null,null,{"$f":"IF(INDEX(AE$71:AE$74,MATCH(AC91,AC$71:AC$74,0))=\"\",\"If testing is required for this benefit classification: \nPlease ensure each different cost-share combination is entered above in PART 1.\",IF(INDEX(AE$71:AE$74,MATCH(AC91,AC$71:AC$74,0))>=(2/3),\"Applies to substantially all medical/surgical benefits in this classification.\nENTER different \"&LOWER(AC91)&\" amounts from smallest to largest.\",\"Does not apply to substantially all medical/surgical benefits in this classification. \nDELETE any values in the left-hand column below.\"))","v":"If testing is required for this benefit classification: \nPlease ensure each different cost-share combination is entered above in PART 1."},null,null,null,null,null,null,null,null,{"$f":"IF(INDEX(AN$71:AN$74,MATCH(AL91,AL$71:AL$74,0))=\"\",\"If testing is required for this benefit classification: \nPlease ensure each different cost-share combination is entered above in PART 1.\",IF(INDEX(AN$71:AN$74,MATCH(AL91,AL$71:AL$74,0))>=(2/3),\"Applies to substantially all medical/surgical benefits in this classification.\nENTER different \"&LOWER(AL91)&\" amounts from smallest to largest.\",\"Does not apply to substantially all medical/surgical benefits in this classification. \nDELETE any values in the left-hand column below.\"))","v":"If testing is required for this benefit classification: \nPlease ensure each different cost-share combination is entered above in PART 1."},null,null,null,null,null,null,null,null,{"$f":"IF(INDEX(AW$71:AW$74,MATCH(AU91,AU$71:AU$74,0))=\"\",\"If testing is required for this benefit classification: \nPlease ensure each different cost-share combination is entered above in PART 1.\",IF(INDEX(AW$71:AW$74,MATCH(AU91,AU$71:AU$74,0))>=(2/3),\"Applies to substantially all medical/surgical benefits in this classification.\nENTER different \"&LOWER(AU91)&\" amounts from smallest to largest.\",\"Does not apply to substantially all medical/surgical benefits in this classification. \nDELETE any values in the left-hand column below.\"))","v":"If testing is required for this benefit classification: \nPlease ensure each different cost-share combination is entered above in PART 1."},null,null,null,null,null,null,null,null,{"$f":"IF(INDEX(BF$71:BF$74,MATCH(BD91,BD$71:BD$74,0))=\"\",\"If testing is required for this benefit classification: \nPlease ensure each different cost-share combination is entered above in PART 1.\",IF(INDEX(BF$71:BF$74,MATCH(BD91,BD$71:BD$74,0))>=(2/3),\"Applies to substantially all medical/surgical benefits in this classification.\nENTER different \"&LOWER(BD91)&\" amounts from smallest to largest.\",\"Does not apply to substantially all medical/surgical benefits in this classification. \nDELETE any values in the left-hand column below.\"))","v":"If testing is required for this benefit classification: \nPlease ensure each different cost-share combination is entered above in PART 1."},null,null,null,null,null,null,null,null,{"$f":"IF(INDEX(BO$71:BO$74,MATCH(BM91,BM$71:BM$74,0))=\"\",\"If testing is required for this benefit classification: \nPlease ensure each different cost-share combination is entered above in PART 1.\",IF(INDEX(BO$71:BO$74,MATCH(BM91,BM$71:BM$74,0))>=(2/3),\"Applies to substantially all medical/surgical benefits in this classification.\nENTER different \"&LOWER(BM91)&\" amounts from smallest to largest.\",\"Does not apply to substantially all medical/surgical benefits in this classification. \nDELETE any values in the left-hand column below.\"))","v":"If testing is required for this benefit classification: \nPlease ensure each different cost-share combination is entered above in PART 1."},null,null,null,null,null,null,null,null,{"$f":"IF(INDEX(BX$71:BX$74,MATCH(BV91,BV$71:BV$74,0))=\"\",\"If testing is required for this benefit classification: \nPlease ensure each different cost-share combination is entered above in PART 1.\",IF(INDEX(BX$71:BX$74,MATCH(BV91,BV$71:BV$74,0))>=(2/3),\"Applies to substantially all medical/surgical benefits in this classification.\nENTER different \"&LOWER(BV91)&\" amounts from smallest to largest.\",\"Does not apply to substantially all medical/surgical benefits in this classification. \nDELETE any values in the left-hand column below.\"))","v":"If testing is required for this benefit classification: \nPlease ensure each different cost-share combination is entered above in PART 1."},null,null,null,null,null,null,null,null,{"$f":"IF(INDEX(CG$71:CG$74,MATCH(CE91,CE$71:CE$74,0))=\"\",\"If testing is required for this benefit classification: \nPlease ensure each different cost-share combination is entered above in PART 1.\",IF(INDEX(CG$71:CG$74,MATCH(CE91,CE$71:CE$74,0))>=(2/3),\"Applies to substantially all medical/surgical benefits in this classification.\nENTER different \"&LOWER(CE91)&\" amounts from smallest to largest.\",\"Does not apply to substantially all medical/surgical benefits in this classification. \nDELETE any values in the left-hand column below.\"))","v":"If testing is required for this benefit classification: \nPlease ensure each different cost-share combination is entered above in PART 1."},null,null,null,null,null,null,null,null,{"$f":"IF(INDEX(CP$71:CP$74,MATCH(CN91,CN$71:CN$74,0))=\"\",\"If testing is required for this benefit classification: \nPlease ensure each different cost-share combination is entered above in PART 1.\",IF(INDEX(CP$71:CP$74,MATCH(CN91,CN$71:CN$74,0))>=(2/3),\"Applies to substantially all medical/surgical benefits in this classification.\nENTER different \"&LOWER(CN91)&\" amounts from smallest to largest.\",\"Does not apply to substantially all medical/surgical benefits in this classification. \nDELETE any values in the left-hand column below.\"))","v":"If testing is required for this benefit classification: \nPlease ensure each different cost-share combination is entered above in PART 1."}]
[null,null,null,null,null,null,null,null,null,null,{"$f":"IF(INDEX(M$71:M$74,MATCH(K92,K$71:K$74,0))=\"\",\"If testing is required for this benefit classification: \nPlease ensure each different cost-share combination is entered above in PART 1.\",IF(INDEX(M$71:M$74,MATCH(K92,K$71:K$74,0))>=(2/3),\"Applies to substantially all medical/surgical benefits in this classification.\nENTER different \"&LOWER(K92)&\" amounts from smallest to largest.\",\"Does not apply to substantially all medical/surgical benefits in this classification. \nDELETE any values in the left-hand column below.\"))","v":"Applies to substantially all medical/surgical benefits in this classification.\nENTER different copayment amounts from smallest to largest."}]
[]
[null,null,null,null,null,null,null,null,null,null,null,null,null,null,null,null,null,null,null,"Copayment","Allowed Claims","Portion","Predominant & Smaller","Error Checking",null,null,null,null,"Copayment","Allowed Claims","Portion","Predominant & Smaller","Error Checking",null,null,null,null,"Copayment","Allowed Claims","Portion","Predominant & Smaller","Error Checking",null,null,null,null,"Copayment","Allowed Claims","Portion","Predominant & Smaller","Error Checking",null,null,null,null,"Copayment","Allowed Claims","Portion","Predominant & Smaller","Error Checking",null,null,null,null,"Copayment","Allowed Claims","Portion","Predominant & Smaller","Error Checking",null,null,null,null,"Copayment","Allowed Claims","Portion","Predominant & Smaller","Error Checking",null,null,null,null,"Copayment","Allowed Claims","Portion","Predominant & Smaller","Error Checking",null,null,null,null,"Copayment","Allowed Claims","Portion","Predominant & Smaller","Error Checking"]
[null,null,null,null,null,null,null,null,null,null,"Copayment","Allowed Claims","Portion","Predominant & Smaller","Error Checking",null,null,null,null,15,{"$f":"SUMIF(tbl_IPOON_P110[Copayment],T92,tbl_IPOON_P110[Plan Projected Allowed Amount])","v":200},{"$f":"IF(OR(U92=0,U92=\"\"),\"\",U92/tbl_IPOON_P2Cop12[[#Totals],[Allowed Claims]])","v":0.322061191626409},{"$f":"IF(V92=\"\",\"\",IF(SUMIF(tbl_IPOON_P2Cop12[Copayment],\">=\"&T92,tbl_IPOON_P2Cop12[Portion])>0.5,T92,\"\"))","v":15},{"$f":"IF(COUNTIF(tbl_IPOON_P2Cop12[Copayment],tbl_IPOON_P2Cop12[[#This Row],[Copayment]])>1,\"Remove Duplicate Entry.\",IF(AND(tbl_IPOON_P2Cop12[[#This Row],[Copayment]]<>\"\",tbl_IPOON_P2Cop12[[#This Row],[Allowed Claims]]=0),\"Entry not found in Part 1 Table\",IF(AND(OFFSET(tbl_IPOON_P2Cop12[[#This Row],[Copayment]],1,0)<>\"Total\",OFFSET(tbl_IPOON_P2Cop12[[#This Row],[Copayment]],1,0)<>\"\",OFFSET(tbl_IPOON_P2Cop12[[#This Row],[Copayment]],1,0)<tbl_IPOON_P2Cop12[[#This Row],[Copayment]]),\"Sort Entries from lowest to highest\",\"\")))","v":""},null,null,null,null,null,{"$f":"SUMIF(tbl_OPINN_P115[Copayment],AC92,tbl_OPINN_P115[Plan Projected Allowed Amount])","v":0},{"$f":"IF(OR(AD92=0,AD92=\"\"),\"\",AD92/tbl_OPINN_P2Cop17[[#Totals],[Allowed Claims]])","v":""},{"$f":"IF(AE92=\"\",\"\",IF(SUMIF(tbl_OPINN_P2Cop17[Copayment],\">=\"&AC92,tbl_OPINN_P2Cop17[Portion])>0.5,AC92,\"\"))","v":""},{"$f":"IF(COUNTIF(tbl_OPINN_P2Cop17[Copayment],tbl_OPINN_P2Cop17[[#This Row],[Copayment]])>1,\"Remove Duplicate Entry.\",IF(AND(tbl_OPINN_P2Cop17[[#This Row],[Copayment]]<>\"\",tbl_OPINN_P2Cop17[[#This Row],[Allowed Claims]]=0),\"Entry not found in Part 1 Table\",IF(AND(OFFSET(tbl_OPINN_P2Cop17[[#This Row],[Copayment]],1,0)<>\"Total\",OFFSET(tbl_OPINN_P2Cop17[[#This Row],[Copayment]],1,0)<>\"\",OFFSET(tbl_OPINN_P2Cop17[[#This Row],[Copayment]],1,0)<tbl_OPINN_P2Cop17[[#This Row],[Copayment]]),\"Sort Entries from lowest to highest\",\"\")))","v":""},null,null,null,null,null,{"$f":"SUMIF(tbl_OPOVINN_P120[Copayment],AL92,tbl_OPOVINN_P120[Plan Projected Allowed Amount])","v":0},{"$f":"IF(OR(AM92=0,AM92=\"\"),\"\",AM92/tbl_OPOVINN_P2Cop22[[#Totals],[Allowed Claims]])","v":""},{"$f":"IF(AN92=\"\",\"\",IF(SUMIF(tbl_OPOVINN_P2Cop22[Copayment],\">=\"&AL92,tbl_OPOVINN_P2Cop22[Portion])>0.5,AL92,\"\"))","v":""},{"$f":"IF(COUNTIF(tbl_OPOVINN_P2Cop22[Copayment],tbl_OPOVINN_P2Cop22[[#This Row],[Copayment]])>1,\"Remove Duplicate Entry.\",IF(AND(tbl_OPOVINN_P2Cop22[[#This Row],[Copayment]]<>\"\",tbl_OPOVINN_P2Cop22[[#This Row],[Allowed Claims]]=0),\"Entry not found in Part 1 Table\",IF(AND(OFFSET(tbl_OPOVINN_P2Cop22[[#This Row],[Copayment]],1,0)<>\"Total\",OFFSET(tbl_OPOVINN_P2Cop22[[#This Row],[Copayment]],1,0)<>\"\",OFFSET(tbl_OPOVINN_P2Cop22[[#This Row],[Copayment]],1,0)<tbl_OPOVINN_P2Cop22[[#This Row],[Copayment]]),\"Sort Entries from lowest to highest\",\"\")))","v":""},null,null,null,null,null,{"$f":"SUMIF(tbl_OPAOINN_P125[Copayment],AU92,tbl_OPAOINN_P125[Plan Projected Allowed Amount])","v":0},{"$f":"IF(OR(AV92=0,AV92=\"\"),\"\",AV92/tbl_OPAOINN_P2Cop27[[#Totals],[Allowed Claims]])","v":""},{"$f":"IF(AW92=\"\",\"\",IF(SUMIF(tbl_OPAOINN_P2Cop27[Copayment],\">=\"&AU92,tbl_OPAOINN_P2Cop27[Portion])>0.5,AU92,\"\"))","v":""},{"$f":"IF(COUNTIF(tbl_OPAOINN_P2Cop27[Copayment],tbl_OPAOINN_P2Cop27[[#This Row],[Copayment]])>1,\"Remove Duplicate Entry.\",IF(AND(tbl_OPAOINN_P2Cop27[[#This Row],[Copayment]]<>\"\",tbl_OPAOINN_P2Cop27[[#This Row],[Allowed Claims]]=0),\"Entry not found in Part 1 Table\",IF(AND(OFFSET(tbl_OPAOINN_P2Cop27[[#This Row],[Copayment]],1,0)<>\"Total\",OFFSET(tbl_OPAOINN_P2Cop27[[#This Row],[Copayment]],1,0)<>\"\",OFFSET(tbl_OPAOINN_P2Cop27[[#This Row],[Copayment]],1,0)<tbl_OPAOINN_P2Cop27[[#This Row],[Copayment]]),\"Sort Entries from lowest to highest\",\"\")))","v":""},null,null,null,null,null,{"$f":"SUMIF(tbl_OPOON_P130[Copayment],BD92,tbl_OPOON_P130[Plan Projected Allowed Amount])","v":0},{"$f":"IF(OR(BE92=0,BE92=\"\"),\"\",BE92/tbl_OPOON_P2Cop32[[#Totals],[Allowed Claims]])","v":""},{"$f":"IF(BF92=\"\",\"\",IF(SUMIF(tbl_OPOON_P2Cop32[Copayment],\">=\"&BD92,tbl_OPOON_P2Cop32[Portion])>0.5,BD92,\"\"))","v":""},{"$f":"IF(COUNTIF(tbl_OPOON_P2Cop32[Copayment],tbl_OPOON_P2Cop32[[#This Row],[Copayment]])>1,\"Remove Duplicate Entry.\",IF(AND(tbl_OPOON_P2Cop32[[#This Row],[Copayment]]<>\"\",tbl_OPOON_P2Cop32[[#This Row],[Allowed Claims]]=0),\"Entry not found in Part 1 Table\",IF(AND(OFFSET(tbl_OPOON_P2Cop32[[#This Row],[Copayment]],1,0)<>\"Total\",OFFSET(tbl_OPOON_P2Cop32[[#This Row],[Copayment]],1,0)<>\"\",OFFSET(tbl_OPOON_P2Cop32[[#This Row],[Copayment]],1,0)<tbl_OPOON_P2Cop32[[#This Row],[Copayment]]),\"Sort Entries from lowest to highest\",\"\")))","v":""},null,null,null,null,null,{"$f":"SUMIF(tbl_OPOVOON_P135[Copayment],BM92,tbl_OPOVOON_P135[Plan Projected Allowed Amount])","v":0},{"$f":"IF(OR(BN92=0,BN92=\"\"),\"\",BN92/tbl_OPOVOON_P2Cop37[[#Totals],[Allowed Claims]])","v":""},{"$f":"IF(BO92=\"\",\"\",IF(SUMIF(tbl_OPOVOON_P2Cop37[Copayment],\">=\"&BM92,tbl_OPOVOON_P2Cop37[Portion])>0.5,BM92,\"\"))","v":""},{"$f":"IF(COUNTIF(tbl_OPOVOON_P2Cop37[Copayment],tbl_OPOVOON_P2Cop37[[#This Row],[Copayment]])>1,\"Remove Duplicate Entry.\",IF(AND(tbl_OPOVOON_P2Cop37[[#This Row],[Copayment]]<>\"\",tbl_OPOVOON_P2Cop37[[#This Row],[Allowed Claims]]=0),\"Entry not found in Part 1 Table\",IF(AND(OFFSET(tbl_OPOVOON_P2Cop37[[#This Row],[Copayment]],1,0)<>\"Total\",OFFSET(tbl_OPOVOON_P2Cop37[[#This Row],[Copayment]],1,0)<>\"\",OFFSET(tbl_OPOVOON_P2Cop37[[#This Row],[Copayment]],1,0)<tbl_OPOVOON_P2Cop37[[#This Row],[Copayment]]),\"Sort Entries from lowest to highest\",\"\")))","v":""},null,null,null,null,null,{"$f":"SUMIF(tbl_OPAOOON_P140[Copayment],BV92,tbl_OPAOOON_P140[Plan Projected Allowed Amount])","v":0},{"$f":"IF(OR(BW92=0,BW92=\"\"),\"\",BW92/tbl_OPAOOON_P2Cop42[[#Totals],[Allowed Claims]])","v":""},{"$f":"IF(BX92=\"\",\"\",IF(SUMIF(tbl_OPAOOON_P2Cop42[Copayment],\">=\"&BV92,tbl_OPAOOON_P2Cop42[Portion])>0.5,BV92,\"\"))","v":""},{"$f":"IF(COUNTIF(tbl_OPAOOON_P2Cop42[Copayment],tbl_OPAOOON_P2Cop42[[#This Row],[Copayment]])>1,\"Remove Duplicate Entry.\",IF(AND(tbl_OPAOOON_P2Cop42[[#This Row],[Copayment]]<>\"\",tbl_OPAOOON_P2Cop42[[#This Row],[Allowed Claims]]=0),\"Entry not found in Part 1 Table\",IF(AND(OFFSET(tbl_OPAOOON_P2Cop42[[#This Row],[Copayment]],1,0)<>\"Total\",OFFSET(tbl_OPAOOON_P2Cop42[[#This Row],[Copayment]],1,0)<>\"\",OFFSET(tbl_OPAOOON_P2Cop42[[#This Row],[Copayment]],1,0)<tbl_OPAOOON_P2Cop42[[#This Row],[Copayment]]),\"Sort Entries from lowest to highest\",\"\")))","v":""},null,null,null,null,null,{"$f":"SUMIF(tbl_ER_P145[Copayment],CE92,tbl_ER_P145[Plan Projected Allowed Amount])","v":0},{"$f":"IF(OR(CF92=0,CF92=\"\"),\"\",CF92/tbl_ER_P2Cop46[[#Totals],[Allowed Claims]])","v":""},{"$f":"IF(CG92=\"\",\"\",IF(SUMIF(tbl_ER_P2Cop46[Copayment],\">=\"&CE92,tbl_ER_P2Cop46[Portion])>0.5,CE92,\"\"))","v":""},{"$f":"IF(COUNTIF(tbl_ER_P2Cop46[Copayment],tbl_ER_P2Cop46[[#This Row],[Copayment]])>1,\"Remove Duplicate Entry.\",IF(AND(tbl_ER_P2Cop46[[#This Row],[Copayment]]<>\"\",tbl_ER_P2Cop46[[#This Row],[Allowed Claims]]=0),\"Entry not found in Part 1 Table\",IF(AND(OFFSET(tbl_ER_P2Cop46[[#This Row],[Copayment]],1,0)<>\"Total\",OFFSET(tbl_ER_P2Cop46[[#This Row],[Copayment]],1,0)<>\"\",OFFSET(tbl_ER_P2Cop46[[#This Row],[Copayment]],1,0)<tbl_ER_P2Cop46[[#This Row],[Copayment]]),\"Sort Entries from lowest to highest\",\"\")))","v":""},null,null,null,null,null,{"$f":"SUMIF(tbl_RX_P149[Copayment],CN92,tbl_RX_P149[Plan Projected Allowed Amount])","v":0},{"$f":"IF(OR(CO92=0,CO92=\"\"),\"\",CO92/tbl_RX_P2Cop51[[#Totals],[Allowed Claims]])","v":""},{"$f":"IF(CP92=\"\",\"\",IF(SUMIF(tbl_RX_P2Cop51[Copayment],\">=\"&CN92,tbl_RX_P2Cop51[Portion])>0.5,CN92,\"\"))","v":""},{"$f":"IF(COUNTIF(tbl_RX_P2Cop51[Copayment],tbl_RX_P2Cop51[[#This Row],[Copayment]])>1,\"Remove Duplicate Entry.\",IF(AND(tbl_RX_P2Cop51[[#This Row],[Copayment]]<>\"\",tbl_RX_P2Cop51[[#This Row],[Allowed Claims]]=0),\"Entry not found in Part 1 Table\",IF(AND(OFFSET(tbl_RX_P2Cop51[[#This Row],[Copayment]],1,0)<>\"Total\",OFFSET(tbl_RX_P2Cop51[[#This Row],[Copayment]],1,0)<>\"\",OFFSET(tbl_RX_P2Cop51[[#This Row],[Copayment]],1,0)<tbl_RX_P2Cop51[[#This Row],[Copayment]]),\"Sort Entries from lowest to highest\",\"\")))","v":""}]
[null,null,null,null,null,null,null,null,null,null,30,{"$f":"SUMIF(tbl_IPINN_P15[Copayment],K93,tbl_IPINN_P15[Plan Projected Allowed Amount])","v":466},{"$f":"IF(OR(L93=0,L93=\"\"),\"\",L93/tbl_IPINN_P2Cop7[[#Totals],[Allowed Claims]])","v":0.13491603937463811},{"$f":"IF(M93=\"\",\"\",IF(SUMIF(tbl_IPINN_P2Cop7[Copayment],\">=\"&K93,tbl_IPINN_P2Cop7[Portion])>0.5,K93,\"\"))","v":""},{"$f":"IF(COUNTIF(tbl_IPINN_P2Cop7[Copayment],tbl_IPINN_P2Cop7[[#This Row],[Copayment]])>1,\"Remove Duplicate Entry.\",IF(AND(tbl_IPINN_P2Cop7[[#This Row],[Copayment]]<>\"\",tbl_IPINN_P2Cop7[[#This Row],[Allowed Claims]]=0),\"Entry not found in Part 1 Table\",IF(AND(OFFSET(tbl_IPINN_P2Cop7[[#This Row],[Copayment]],1,0)<>\"Total\",OFFSET(tbl_IPINN_P2Cop7[[#This Row],[Copayment]],1,0)<>\"\",OFFSET(tbl_IPINN_P2Cop7[[#This Row],[Copayment]],1,0)<tbl_IPINN_P2Cop7[[#This Row],[Copayment]]),\"Sort Entries from lowest to highest\",\"\")))","v":"Sort Entries from lowest to highest"},null,null,null,null,20,{"$f":"SUMIF(tbl_IPOON_P110[Copayment],T93,tbl_IPOON_P110[Plan Projected Allowed Amount])","v":57},{"$f":"IF(OR(U93=0,U93=\"\"),\"\",U93/tbl_IPOON_P2Cop12[[#Totals],[Allowed Claims]])","v":9.1787439613526575E-2},{"$f":"IF(V93=\"\",\"\",IF(SUMIF(tbl_IPOON_P2Cop12[Copayment],\">=\"&T93,tbl_IPOON_P2Cop12[Portion])>0.5,T93,\"\"))","v":20},{"$f":"IF(COUNTIF(tbl_IPOON_P2Cop12[Copayment],tbl_IPOON_P2Cop12[[#This Row],[Copayment]])>1,\"Remove Duplicate Entry.\",IF(AND(tbl_IPOON_P2Cop12[[#This Row],[Copayment]]<>\"\",tbl_IPOON_P2Cop12[[#This Row],[Allowed Claims]]=0),\"Entry not found in Part 1 Table\",IF(AND(OFFSET(tbl_IPOON_P2Cop12[[#This Row],[Copayment]],1,0)<>\"Total\",OFFSET(tbl_IPOON_P2Cop12[[#This Row],[Copayment]],1,0)<>\"\",OFFSET(tbl_IPOON_P2Cop12[[#This Row],[Copayment]],1,0)<tbl_IPOON_P2Cop12[[#This Row],[Copayment]]),\"Sort Entries from lowest to highest\",\"\")))","v":""},null,null,null,null,null,{"$f":"SUMIF(tbl_OPINN_P115[Copayment],AC93,tbl_OPINN_P115[Plan Projected Allowed Amount])","v":0},{"$f":"IF(OR(AD93=0,AD93=\"\"),\"\",AD93/tbl_OPINN_P2Cop17[[#Totals],[Allowed Claims]])","v":""},{"$f":"IF(AE93=\"\",\"\",IF(SUMIF(tbl_OPINN_P2Cop17[Copayment],\">=\"&AC93,tbl_OPINN_P2Cop17[Portion])>0.5,AC93,\"\"))","v":""},{"$f":"IF(COUNTIF(tbl_OPINN_P2Cop17[Copayment],tbl_OPINN_P2Cop17[[#This Row],[Copayment]])>1,\"Remove Duplicate Entry.\",IF(AND(tbl_OPINN_P2Cop17[[#This Row],[Copayment]]<>\"\",tbl_OPINN_P2Cop17[[#This Row],[Allowed Claims]]=0),\"Entry not found in Part 1 Table\",IF(AND(OFFSET(tbl_OPINN_P2Cop17[[#This Row],[Copayment]],1,0)<>\"Total\",OFFSET(tbl_OPINN_P2Cop17[[#This Row],[Copayment]],1,0)<>\"\",OFFSET(tbl_OPINN_P2Cop17[[#This Row],[Copayment]],1,0)<tbl_OPINN_P2Cop17[[#This Row],[Copayment]]),\"Sort Entries from lowest to highest\",\"\")))","v":""},null,null,null,null,null,{"$f":"SUMIF(tbl_OPOVINN_P120[Copayment],AL93,tbl_OPOVINN_P120[Plan Projected Allowed Amount])","v":0},{"$f":"IF(OR(AM93=0,AM93=\"\"),\"\",AM93/tbl_OPOVINN_P2Cop22[[#Totals],[Allowed Claims]])","v":""},{"$f":"IF(AN93=\"\",\"\",IF(SUMIF(tbl_OPOVINN_P2Cop22[Copayment],\">=\"&AL93,tbl_OPOVINN_P2Cop22[Portion])>0.5,AL93,\"\"))","v":""},{"$f":"IF(COUNTIF(tbl_OPOVINN_P2Cop22[Copayment],tbl_OPOVINN_P2Cop22[[#This Row],[Copayment]])>1,\"Remove Duplicate Entry.\",IF(AND(tbl_OPOVINN_P2Cop22[[#This Row],[Copayment]]<>\"\",tbl_OPOVINN_P2Cop22[[#This Row],[Allowed Claims]]=0),\"Entry not found in Part 1 Table\",IF(AND(OFFSET(tbl_OPOVINN_P2Cop22[[#This Row],[Copayment]],1,0)<>\"Total\",OFFSET(tbl_OPOVINN_P2Cop22[[#This Row],[Copayment]],1,0)<>\"\",OFFSET(tbl_OPOVINN_P2Cop22[[#This Row],[Copayment]],1,0)<tbl_OPOVINN_P2Cop22[[#This Row],[Copayment]]),\"Sort Entries from lowest to highest\",\"\")))","v":""},null,null,null,null,null,{"$f":"SUMIF(tbl_OPAOINN_P125[Copayment],AU93,tbl_OPAOINN_P125[Plan Projected Allowed Amount])","v":0},{"$f":"IF(OR(AV93=0,AV93=\"\"),\"\",AV93/tbl_OPAOINN_P2Cop27[[#Totals],[Allowed Claims]])","v":""},{"$f":"IF(AW93=\"\",\"\",IF(SUMIF(tbl_OPAOINN_P2Cop27[Copayment],\">=\"&AU93,tbl_OPAOINN_P2Cop27[Portion])>0.5,AU93,\"\"))","v":""},{"$f":"IF(COUNTIF(tbl_OPAOINN_P2Cop27[Copayment],tbl_OPAOINN_P2Cop27[[#This Row],[Copayment]])>1,\"Remove Duplicate Entry.\",IF(AND(tbl_OPAOINN_P2Cop27[[#This Row],[Copayment]]<>\"\",tbl_OPAOINN_P2Cop27[[#This Row],[Allowed Claims]]=0),\"Entry not found in Part 1 Table\",IF(AND(OFFSET(tbl_OPAOINN_P2Cop27[[#This Row],[Copayment]],1,0)<>\"Total\",OFFSET(tbl_OPAOINN_P2Cop27[[#This Row],[Copayment]],1,0)<>\"\",OFFSET(tbl_OPAOINN_P2Cop27[[#This Row],[Copayment]],1,0)<tbl_OPAOINN_P2Cop27[[#This Row],[Copayment]]),\"Sort Entries from lowest to highest\",\"\")))","v":""},null,null,null,null,null,{"$f":"SUMIF(tbl_OPOON_P130[Copayment],BD93,tbl_OPOON_P130[Plan Projected Allowed Amount])","v":0},{"$f":"IF(OR(BE93=0,BE93=\"\"),\"\",BE93/tbl_OPOON_P2Cop32[[#Totals],[Allowed Claims]])","v":""},{"$f":"IF(BF93=\"\",\"\",IF(SUMIF(tbl_OPOON_P2Cop32[Copayment],\">=\"&BD93,tbl_OPOON_P2Cop32[Portion])>0.5,BD93,\"\"))","v":""},{"$f":"IF(COUNTIF(tbl_OPOON_P2Cop32[Copayment],tbl_OPOON_P2Cop32[[#This Row],[Copayment]])>1,\"Remove Duplicate Entry.\",IF(AND(tbl_OPOON_P2Cop32[[#This Row],[Copayment]]<>\"\",tbl_OPOON_P2Cop32[[#This Row],[Allowed Claims]]=0),\"Entry not found in Part 1 Table\",IF(AND(OFFSET(tbl_OPOON_P2Cop32[[#This Row],[Copayment]],1,0)<>\"Total\",OFFSET(tbl_OPOON_P2Cop32[[#This Row],[Copayment]],1,0)<>\"\",OFFSET(tbl_OPOON_P2Cop32[[#This Row],[Copayment]],1,0)<tbl_OPOON_P2Cop32[[#This Row],[Copayment]]),\"Sort Entries from lowest to highest\",\"\")))","v":""},null,null,null,null,null,{"$f":"SUMIF(tbl_OPOVOON_P135[Copayment],BM93,tbl_OPOVOON_P135[Plan Projected Allowed Amount])","v":0},{"$f":"IF(OR(BN93=0,BN93=\"\"),\"\",BN93/tbl_OPOVOON_P2Cop37[[#Totals],[Allowed Claims]])","v":""},{"$f":"IF(BO93=\"\",\"\",IF(SUMIF(tbl_OPOVOON_P2Cop37[Copayment],\">=\"&BM93,tbl_OPOVOON_P2Cop37[Portion])>0.5,BM93,\"\"))","v":""},{"$f":"IF(COUNTIF(tbl_OPOVOON_P2Cop37[Copayment],tbl_OPOVOON_P2Cop37[[#This Row],[Copayment]])>1,\"Remove Duplicate Entry.\",IF(AND(tbl_OPOVOON_P2Cop37[[#This Row],[Copayment]]<>\"\",tbl_OPOVOON_P2Cop37[[#This Row],[Allowed Claims]]=0),\"Entry not found in Part 1 Table\",IF(AND(OFFSET(tbl_OPOVOON_P2Cop37[[#This Row],[Copayment]],1,0)<>\"Total\",OFFSET(tbl_OPOVOON_P2Cop37[[#This Row],[Copayment]],1,0)<>\"\",OFFSET(tbl_OPOVOON_P2Cop37[[#This Row],[Copayment]],1,0)<tbl_OPOVOON_P2Cop37[[#This Row],[Copayment]]),\"Sort Entries from lowest to highest\",\"\")))","v":""},null,null,null,null,null,{"$f":"SUMIF(tbl_OPAOOON_P140[Copayment],BV93,tbl_OPAOOON_P140[Plan Projected Allowed Amount])","v":0},{"$f":"IF(OR(BW93=0,BW93=\"\"),\"\",BW93/tbl_OPAOOON_P2Cop42[[#Totals],[Allowed Claims]])","v":""},{"$f":"IF(BX93=\"\",\"\",IF(SUMIF(tbl_OPAOOON_P2Cop42[Copayment],\">=\"&BV93,tbl_OPAOOON_P2Cop42[Portion])>0.5,BV93,\"\"))","v":""},{"$f":"IF(COUNTIF(tbl_OPAOOON_P2Cop42[Copayment],tbl_OPAOOON_P2Cop42[[#This Row],[Copayment]])>1,\"Remove Duplicate Entry.\",IF(AND(tbl_OPAOOON_P2Cop42[[#This Row],[Copayment]]<>\"\",tbl_OPAOOON_P2Cop42[[#This Row],[Allowed Claims]]=0),\"Entry not found in Part 1 Table\",IF(AND(OFFSET(tbl_OPAOOON_P2Cop42[[#This Row],[Copayment]],1,0)<>\"Total\",OFFSET(tbl_OPAOOON_P2Cop42[[#This Row],[Copayment]],1,0)<>\"\",OFFSET(tbl_OPAOOON_P2Cop42[[#This Row],[Copayment]],1,0)<tbl_OPAOOON_P2Cop42[[#This Row],[Copayment]]),\"Sort Entries from lowest to highest\",\"\")))","v":""},null,null,null,null,null,{"$f":"SUMIF(tbl_ER_P145[Copayment],CE93,tbl_ER_P145[Plan Projected Allowed Amount])","v":0},{"$f":"IF(OR(CF93=0,CF93=\"\"),\"\",CF93/tbl_ER_P2Cop46[[#Totals],[Allowed Claims]])","v":""},{"$f":"IF(CG93=\"\",\"\",IF(SUMIF(tbl_ER_P2Cop46[Copayment],\">=\"&CE93,tbl_ER_P2Cop46[Portion])>0.5,CE93,\"\"))","v":""},{"$f":"IF(COUNTIF(tbl_ER_P2Cop46[Copayment],tbl_ER_P2Cop46[[#This Row],[Copayment]])>1,\"Remove Duplicate Entry.\",IF(AND(tbl_ER_P2Cop46[[#This Row],[Copayment]]<>\"\",tbl_ER_P2Cop46[[#This Row],[Allowed Claims]]=0),\"Entry not found in Part 1 Table\",IF(AND(OFFSET(tbl_ER_P2Cop46[[#This Row],[Copayment]],1,0)<>\"Total\",OFFSET(tbl_ER_P2Cop46[[#This Row],[Copayment]],1,0)<>\"\",OFFSET(tbl_ER_P2Cop46[[#This Row],[Copayment]],1,0)<tbl_ER_P2Cop46[[#This Row],[Copayment]]),\"Sort Entries from lowest to highest\",\"\")))","v":""},null,null,null,null,null,{"$f":"SUMIF(tbl_RX_P149[Copayment],CN93,tbl_RX_P149[Plan Projected Allowed Amount])","v":0},{"$f":"IF(OR(CO93=0,CO93=\"\"),\"\",CO93/tbl_RX_P2Cop51[[#Totals],[Allowed Claims]])","v":""},{"$f":"IF(CP93=\"\",\"\",IF(SUMIF(tbl_RX_P2Cop51[Copayment],\">=\"&CN93,tbl_RX_P2Cop51[Portion])>0.5,CN93,\"\"))","v":""},{"$f":"IF(COUNTIF(tbl_RX_P2Cop51[Copayment],tbl_RX_P2Cop51[[#This Row],[Copayment]])>1,\"Remove Duplicate Entry.\",IF(AND(tbl_RX_P2Cop51[[#This Row],[Copayment]]<>\"\",tbl_RX_P2Cop51[[#This Row],[Allowed Claims]]=0),\"Entry not found in Part 1 Table\",IF(AND(OFFSET(tbl_RX_P2Cop51[[#This Row],[Copayment]],1,0)<>\"Total\",OFFSET(tbl_RX_P2Cop51[[#This Row],[Copayment]],1,0)<>\"\",OFFSET(tbl_RX_P2Cop51[[#This Row],[Copayment]],1,0)<tbl_RX_P2Cop51[[#This Row],[Copayment]]),\"Sort Entries from lowest to highest\",\"\")))","v":""}]
[null,null,null,null,null,null,null,null,null,null,15,{"$f":"SUMIF(tbl_IPINN_P15[Copayment],K94,tbl_IPINN_P15[Plan Projected Allowed Amount])","v":1494},{"$f":"IF(OR(L94=0,L94=\"\"),\"\",L94/tbl_IPINN_P2Cop7[[#Totals],[Allowed Claims]])","v":0.43254198031268093},{"$f":"IF(M94=\"\",\"\",IF(SUMIF(tbl_IPINN_P2Cop7[Copayment],\">=\"&K94,tbl_IPINN_P2Cop7[Portion])>0.5,K94,\"\"))","v":15},{"$f":"IF(COUNTIF(tbl_IPINN_P2Cop7[Copayment],tbl_IPINN_P2Cop7[[#This Row],[Copayment]])>1,\"Remove Duplicate Entry.\",IF(AND(tbl_IPINN_P2Cop7[[#This Row],[Copayment]]<>\"\",tbl_IPINN_P2Cop7[[#This Row],[Allowed Claims]]=0),\"Entry not found in Part 1 Table\",IF(AND(OFFSET(tbl_IPINN_P2Cop7[[#This Row],[Copayment]],1,0)<>\"Total\",OFFSET(tbl_IPINN_P2Cop7[[#This Row],[Copayment]],1,0)<>\"\",OFFSET(tbl_IPINN_P2Cop7[[#This Row],[Copayment]],1,0)<tbl_IPINN_P2Cop7[[#This Row],[Copayment]]),\"Sort Entries from lowest to highest\",\"\")))","v":"Remove Duplicate Entry."},null,null,null,null,30,{"$f":"SUMIF(tbl_IPOON_P110[Copayment],T94,tbl_IPOON_P110[Plan Projected Allowed Amount])","v":364},{"$f":"IF(OR(U94=0,U94=\"\"),\"\",U94/tbl_IPOON_P2Cop12[[#Totals],[Allowed Claims]])","v":0.58615136876006446},{"$f":"IF(V94=\"\",\"\",IF(SUMIF(tbl_IPOON_P2Cop12[Copayment],\">=\"&T94,tbl_IPOON_P2Cop12[Portion])>0.5,T94,\"\"))","v":30},{"$f":"IF(COUNTIF(tbl_IPOON_P2Cop12[Copayment],tbl_IPOON_P2Cop12[[#This Row],[Copayment]])>1,\"Remove Duplicate Entry.\",IF(AND(tbl_IPOON_P2Cop12[[#This Row],[Copayment]]<>\"\",tbl_IPOON_P2Cop12[[#This Row],[Allowed Claims]]=0),\"Entry not found in Part 1 Table\",IF(AND(OFFSET(tbl_IPOON_P2Cop12[[#This Row],[Copayment]],1,0)<>\"Total\",OFFSET(tbl_IPOON_P2Cop12[[#This Row],[Copayment]],1,0)<>\"\",OFFSET(tbl_IPOON_P2Cop12[[#This Row],[Copayment]],1,0)<tbl_IPOON_P2Cop12[[#This Row],[Copayment]]),\"Sort Entries from lowest to highest\",\"\")))","v":""},null,null,null,null,null,{"$f":"SUMIF(tbl_OPINN_P115[Copayment],AC94,tbl_OPINN_P115[Plan Projected Allowed Amount])","v":0},{"$f":"IF(OR(AD94=0,AD94=\"\"),\"\",AD94/tbl_OPINN_P2Cop17[[#Totals],[Allowed Claims]])","v":""},{"$f":"IF(AE94=\"\",\"\",IF(SUMIF(tbl_OPINN_P2Cop17[Copayment],\">=\"&AC94,tbl_OPINN_P2Cop17[Portion])>0.5,AC94,\"\"))","v":""},{"$f":"IF(COUNTIF(tbl_OPINN_P2Cop17[Copayment],tbl_OPINN_P2Cop17[[#This Row],[Copayment]])>1,\"Remove Duplicate Entry.\",IF(AND(tbl_OPINN_P2Cop17[[#This Row],[Copayment]]<>\"\",tbl_OPINN_P2Cop17[[#This Row],[Allowed Claims]]=0),\"Entry not found in Part 1 Table\",IF(AND(OFFSET(tbl_OPINN_P2Cop17[[#This Row],[Copayment]],1,0)<>\"Total\",OFFSET(tbl_OPINN_P2Cop17[[#This Row],[Copayment]],1,0)<>\"\",OFFSET(tbl_OPINN_P2Cop17[[#This Row],[Copayment]],1,0)<tbl_OPINN_P2Cop17[[#This Row],[Copayment]]),\"Sort Entries from lowest to highest\",\"\")))","v":""},null,null,null,null,null,{"$f":"SUMIF(tbl_OPOVINN_P120[Copayment],AL94,tbl_OPOVINN_P120[Plan Projected Allowed Amount])","v":0},{"$f":"IF(OR(AM94=0,AM94=\"\"),\"\",AM94/tbl_OPOVINN_P2Cop22[[#Totals],[Allowed Claims]])","v":""},{"$f":"IF(AN94=\"\",\"\",IF(SUMIF(tbl_OPOVINN_P2Cop22[Copayment],\">=\"&AL94,tbl_OPOVINN_P2Cop22[Portion])>0.5,AL94,\"\"))","v":""},{"$f":"IF(COUNTIF(tbl_OPOVINN_P2Cop22[Copayment],tbl_OPOVINN_P2Cop22[[#This Row],[Copayment]])>1,\"Remove Duplicate Entry.\",IF(AND(tbl_OPOVINN_P2Cop22[[#This Row],[Copayment]]<>\"\",tbl_OPOVINN_P2Cop22[[#This Row],[Allowed Claims]]=0),\"Entry not found in Part 1 Table\",IF(AND(OFFSET(tbl_OPOVINN_P2Cop22[[#This Row],[Copayment]],1,0)<>\"Total\",OFFSET(tbl_OPOVINN_P2Cop22[[#This Row],[Copayment]],1,0)<>\"\",OFFSET(tbl_OPOVINN_P2Cop22[[#This Row],[Copayment]],1,0)<tbl_OPOVINN_P2Cop22[[#This Row],[Copayment]]),\"Sort Entries from lowest to highest\",\"\")))","v":""},null,null,null,null,null,{"$f":"SUMIF(tbl_OPAOINN_P125[Copayment],AU94,tbl_OPAOINN_P125[Plan Projected Allowed Amount])","v":0},{"$f":"IF(OR(AV94=0,AV94=\"\"),\"\",AV94/tbl_OPAOINN_P2Cop27[[#Totals],[Allowed Claims]])","v":""},{"$f":"IF(AW94=\"\",\"\",IF(SUMIF(tbl_OPAOINN_P2Cop27[Copayment],\">=\"&AU94,tbl_OPAOINN_P2Cop27[Portion])>0.5,AU94,\"\"))","v":""},{"$f":"IF(COUNTIF(tbl_OPAOINN_P2Cop27[Copayment],tbl_OPAOINN_P2Cop27[[#This Row],[Copayment]])>1,\"Remove Duplicate Entry.\",IF(AND(tbl_OPAOINN_P2Cop27[[#This Row],[Copayment]]<>\"\",tbl_OPAOINN_P2Cop27[[#This Row],[Allowed Claims]]=0),\"Entry not found in Part 1 Table\",IF(AND(OFFSET(tbl_OPAOINN_P2Cop27[[#This Row],[Copayment]],1,0)<>\"Total\",OFFSET(tbl_OPAOINN_P2Cop27[[#This Row],[Copayment]],1,0)<>\"\",OFFSET(tbl_OPAOINN_P2Cop27[[#This Row],[Copayment]],1,0)<tbl_OPAOINN_P2Cop27[[#This Row],[Copayment]]),\"Sort Entries from lowest to highest\",\"\")))","v":""},null,null,null,null,null,{"$f":"SUMIF(tbl_OPOON_P130[Copayment],BD94,tbl_OPOON_P130[Plan Projected Allowed Amount])","v":0},{"$f":"IF(OR(BE94=0,BE94=\"\"),\"\",BE94/tbl_OPOON_P2Cop32[[#Totals],[Allowed Claims]])","v":""},{"$f":"IF(BF94=\"\",\"\",IF(SUMIF(tbl_OPOON_P2Cop32[Copayment],\">=\"&BD94,tbl_OPOON_P2Cop32[Portion])>0.5,BD94,\"\"))","v":""},{"$f":"IF(COUNTIF(tbl_OPOON_P2Cop32[Copayment],tbl_OPOON_P2Cop32[[#This Row],[Copayment]])>1,\"Remove Duplicate Entry.\",IF(AND(tbl_OPOON_P2Cop32[[#This Row],[Copayment]]<>\"\",tbl_OPOON_P2Cop32[[#This Row],[Allowed Claims]]=0),\"Entry not found in Part 1 Table\",IF(AND(OFFSET(tbl_OPOON_P2Cop32[[#This Row],[Copayment]],1,0)<>\"Total\",OFFSET(tbl_OPOON_P2Cop32[[#This Row],[Copayment]],1,0)<>\"\",OFFSET(tbl_OPOON_P2Cop32[[#This Row],[Copayment]],1,0)<tbl_OPOON_P2Cop32[[#This Row],[Copayment]]),\"Sort Entries from lowest to highest\",\"\")))","v":""},null,null,null,null,null,{"$f":"SUMIF(tbl_OPOVOON_P135[Copayment],BM94,tbl_OPOVOON_P135[Plan Projected Allowed Amount])","v":0},{"$f":"IF(OR(BN94=0,BN94=\"\"),\"\",BN94/tbl_OPOVOON_P2Cop37[[#Totals],[Allowed Claims]])","v":""},{"$f":"IF(BO94=\"\",\"\",IF(SUMIF(tbl_OPOVOON_P2Cop37[Copayment],\">=\"&BM94,tbl_OPOVOON_P2Cop37[Portion])>0.5,BM94,\"\"))","v":""},{"$f":"IF(COUNTIF(tbl_OPOVOON_P2Cop37[Copayment],tbl_OPOVOON_P2Cop37[[#This Row],[Copayment]])>1,\"Remove Duplicate Entry.\",IF(AND(tbl_OPOVOON_P2Cop37[[#This Row],[Copayment]]<>\"\",tbl_OPOVOON_P2Cop37[[#This Row],[Allowed Claims]]=0),\"Entry not found in Part 1 Table\",IF(AND(OFFSET(tbl_OPOVOON_P2Cop37[[#This Row],[Copayment]],1,0)<>\"Total\",OFFSET(tbl_OPOVOON_P2Cop37[[#This Row],[Copayment]],1,0)<>\"\",OFFSET(tbl_OPOVOON_P2Cop37[[#This Row],[Copayment]],1,0)<tbl_OPOVOON_P2Cop37[[#This Row],[Copayment]]),\"Sort Entries from lowest to highest\",\"\")))","v":""},null,null,null,null,null,{"$f":"SUMIF(tbl_OPAOOON_P140[Copayment],BV94,tbl_OPAOOON_P140[Plan Projected Allowed Amount])","v":0},{"$f":"IF(OR(BW94=0,BW94=\"\"),\"\",BW94/tbl_OPAOOON_P2Cop42[[#Totals],[Allowed Claims]])","v":""},{"$f":"IF(BX94=\"\",\"\",IF(SUMIF(tbl_OPAOOON_P2Cop42[Copayment],\">=\"&BV94,tbl_OPAOOON_P2Cop42[Portion])>0.5,BV94,\"\"))","v":""},{"$f":"IF(COUNTIF(tbl_OPAOOON_P2Cop42[Copayment],tbl_OPAOOON_P2Cop42[[#This Row],[Copayment]])>1,\"Remove Duplicate Entry.\",IF(AND(tbl_OPAOOON_P2Cop42[[#This Row],[Copayment]]<>\"\",tbl_OPAOOON_P2Cop42[[#This Row],[Allowed Claims]]=0),\"Entry not found in Part 1 Table\",IF(AND(OFFSET(tbl_OPAOOON_P2Cop42[[#This Row],[Copayment]],1,0)<>\"Total\",OFFSET(tbl_OPAOOON_P2Cop42[[#This Row],[Copayment]],1,0)<>\"\",OFFSET(tbl_OPAOOON_P2Cop42[[#This Row],[Copayment]],1,0)<tbl_OPAOOON_P2Cop42[[#This Row],[Copayment]]),\"Sort Entries from lowest to highest\",\"\")))","v":""},null,null,null,null,null,{"$f":"SUMIF(tbl_ER_P145[Copayment],CE94,tbl_ER_P145[Plan Projected Allowed Amount])","v":0},{"$f":"IF(OR(CF94=0,CF94=\"\"),\"\",CF94/tbl_ER_P2Cop46[[#Totals],[Allowed Claims]])","v":""},{"$f":"IF(CG94=\"\",\"\",IF(SUMIF(tbl_ER_P2Cop46[Copayment],\">=\"&CE94,tbl_ER_P2Cop46[Portion])>0.5,CE94,\"\"))","v":""},{"$f":"IF(COUNTIF(tbl_ER_P2Cop46[Copayment],tbl_ER_P2Cop46[[#This Row],[Copayment]])>1,\"Remove Duplicate Entry.\",IF(AND(tbl_ER_P2Cop46[[#This Row],[Copayment]]<>\"\",tbl_ER_P2Cop46[[#This Row],[Allowed Claims]]=0),\"Entry not found in Part 1 Table\",IF(AND(OFFSET(tbl_ER_P2Cop46[[#This Row],[Copayment]],1,0)<>\"Total\",OFFSET(tbl_ER_P2Cop46[[#This Row],[Copayment]],1,0)<>\"\",OFFSET(tbl_ER_P2Cop46[[#This Row],[Copayment]],1,0)<tbl_ER_P2Cop46[[#This Row],[Copayment]]),\"Sort Entries from lowest to highest\",\"\")))","v":""},null,null,null,null,null,{"$f":"SUMIF(tbl_RX_P149[Copayment],CN94,tbl_RX_P149[Plan Projected Allowed Amount])","v":0},{"$f":"IF(OR(CO94=0,CO94=\"\"),\"\",CO94/tbl_RX_P2Cop51[[#Totals],[Allowed Claims]])","v":""},{"$f":"IF(CP94=\"\",\"\",IF(SUMIF(tbl_RX_P2Cop51[Copayment],\">=\"&CN94,tbl_RX_P2Cop51[Portion])>0.5,CN94,\"\"))","v":""},{"$f":"IF(COUNTIF(tbl_RX_P2Cop51[Copayment],tbl_RX_P2Cop51[[#This Row],[Copayment]])>1,\"Remove Duplicate Entry.\",IF(AND(tbl_RX_P2Cop51[[#This Row],[Copayment]]<>\"\",tbl_RX_P2Cop51[[#This Row],[Allowed Claims]]=0),\"Entry not found in Part 1 Table\",IF(AND(OFFSET(tbl_RX_P2Cop51[[#This Row],[Copayment]],1,0)<>\"Total\",OFFSET(tbl_RX_P2Cop51[[#This Row],[Copayment]],1,0)<>\"\",OFFSET(tbl_RX_P2Cop51[[#This Row],[Copayment]],1,0)<tbl_RX_P2Cop51[[#This Row],[Copayment]]),\"Sort Entries from lowest to highest\",\"\")))","v":""}]
[null,null,null,null,null,null,null,null,null,null,15,{"$f":"SUMIF(tbl_IPINN_P15[Copayment],K95,tbl_IPINN_P15[Plan Projected Allowed Amount])","v":1494},{"$f":"IF(OR(L95=0,L95=\"\"),\"\",L95/tbl_IPINN_P2Cop7[[#Totals],[Allowed Claims]])","v":0.43254198031268093},{"$f":"IF(M95=\"\",\"\",IF(SUMIF(tbl_IPINN_P2Cop7[Copayment],\">=\"&K95,tbl_IPINN_P2Cop7[Portion])>0.5,K95,\"\"))","v":15},{"$f":"IF(COUNTIF(tbl_IPINN_P2Cop7[Copayment],tbl_IPINN_P2Cop7[[#This Row],[Copayment]])>1,\"Remove Duplicate Entry.\",IF(AND(tbl_IPINN_P2Cop7[[#This Row],[Copayment]]<>\"\",tbl_IPINN_P2Cop7[[#This Row],[Allowed Claims]]=0),\"Entry not found in Part 1 Table\",IF(AND(OFFSET(tbl_IPINN_P2Cop7[[#This Row],[Copayment]],1,0)<>\"Total\",OFFSET(tbl_IPINN_P2Cop7[[#This Row],[Copayment]],1,0)<>\"\",OFFSET(tbl_IPINN_P2Cop7[[#This Row],[Copayment]],1,0)<tbl_IPINN_P2Cop7[[#This Row],[Copayment]]),\"Sort Entries from lowest to highest\",\"\")))","v":"Remove Duplicate Entry."},null,null,null,null,null,{"$f":"SUMIF(tbl_IPOON_P110[Copayment],T95,tbl_IPOON_P110[Plan Projected Allowed Amount])","v":0},{"$f":"IF(OR(U95=0,U95=\"\"),\"\",U95/tbl_IPOON_P2Cop12[[#Totals],[Allowed Claims]])","v":""},{"$f":"IF(V95=\"\",\"\",IF(SUMIF(tbl_IPOON_P2Cop12[Copayment],\">=\"&T95,tbl_IPOON_P2Cop12[Portion])>0.5,T95,\"\"))","v":""},{"$f":"IF(COUNTIF(tbl_IPOON_P2Cop12[Copayment],tbl_IPOON_P2Cop12[[#This Row],[Copayment]])>1,\"Remove Duplicate Entry.\",IF(AND(tbl_IPOON_P2Cop12[[#This Row],[Copayment]]<>\"\",tbl_IPOON_P2Cop12[[#This Row],[Allowed Claims]]=0),\"Entry not found in Part 1 Table\",IF(AND(OFFSET(tbl_IPOON_P2Cop12[[#This Row],[Copayment]],1,0)<>\"Total\",OFFSET(tbl_IPOON_P2Cop12[[#This Row],[Copayment]],1,0)<>\"\",OFFSET(tbl_IPOON_P2Cop12[[#This Row],[Copayment]],1,0)<tbl_IPOON_P2Cop12[[#This Row],[Copayment]]),\"Sort Entries from lowest to highest\",\"\")))","v":""},null,null,null,null,null,{"$f":"SUMIF(tbl_OPINN_P115[Copayment],AC95,tbl_OPINN_P115[Plan Projected Allowed Amount])","v":0},{"$f":"IF(OR(AD95=0,AD95=\"\"),\"\",AD95/tbl_OPINN_P2Cop17[[#Totals],[Allowed Claims]])","v":""},{"$f":"IF(AE95=\"\",\"\",IF(SUMIF(tbl_OPINN_P2Cop17[Copayment],\">=\"&AC95,tbl_OPINN_P2Cop17[Portion])>0.5,AC95,\"\"))","v":""},{"$f":"IF(COUNTIF(tbl_OPINN_P2Cop17[Copayment],tbl_OPINN_P2Cop17[[#This Row],[Copayment]])>1,\"Remove Duplicate Entry.\",IF(AND(tbl_OPINN_P2Cop17[[#This Row],[Copayment]]<>\"\",tbl_OPINN_P2Cop17[[#This Row],[Allowed Claims]]=0),\"Entry not found in Part 1 Table\",IF(AND(OFFSET(tbl_OPINN_P2Cop17[[#This Row],[Copayment]],1,0)<>\"Total\",OFFSET(tbl_OPINN_P2Cop17[[#This Row],[Copayment]],1,0)<>\"\",OFFSET(tbl_OPINN_P2Cop17[[#This Row],[Copayment]],1,0)<tbl_OPINN_P2Cop17[[#This Row],[Copayment]]),\"Sort Entries from lowest to highest\",\"\")))","v":""},null,null,null,null,null,{"$f":"SUMIF(tbl_OPOVINN_P120[Copayment],AL95,tbl_OPOVINN_P120[Plan Projected Allowed Amount])","v":0},{"$f":"IF(OR(AM95=0,AM95=\"\"),\"\",AM95/tbl_OPOVINN_P2Cop22[[#Totals],[Allowed Claims]])","v":""},{"$f":"IF(AN95=\"\",\"\",IF(SUMIF(tbl_OPOVINN_P2Cop22[Copayment],\">=\"&AL95,tbl_OPOVINN_P2Cop22[Portion])>0.5,AL95,\"\"))","v":""},{"$f":"IF(COUNTIF(tbl_OPOVINN_P2Cop22[Copayment],tbl_OPOVINN_P2Cop22[[#This Row],[Copayment]])>1,\"Remove Duplicate Entry.\",IF(AND(tbl_OPOVINN_P2Cop22[[#This Row],[Copayment]]<>\"\",tbl_OPOVINN_P2Cop22[[#This Row],[Allowed Claims]]=0),\"Entry not found in Part 1 Table\",IF(AND(OFFSET(tbl_OPOVINN_P2Cop22[[#This Row],[Copayment]],1,0)<>\"Total\",OFFSET(tbl_OPOVINN_P2Cop22[[#This Row],[Copayment]],1,0)<>\"\",OFFSET(tbl_OPOVINN_P2Cop22[[#This Row],[Copayment]],1,0)<tbl_OPOVINN_P2Cop22[[#This Row],[Copayment]]),\"Sort Entries from lowest to highest\",\"\")))","v":""},null,null,null,null,null,{"$f":"SUMIF(tbl_OPAOINN_P125[Copayment],AU95,tbl_OPAOINN_P125[Plan Projected Allowed Amount])","v":0},{"$f":"IF(OR(AV95=0,AV95=\"\"),\"\",AV95/tbl_OPAOINN_P2Cop27[[#Totals],[Allowed Claims]])","v":""},{"$f":"IF(AW95=\"\",\"\",IF(SUMIF(tbl_OPAOINN_P2Cop27[Copayment],\">=\"&AU95,tbl_OPAOINN_P2Cop27[Portion])>0.5,AU95,\"\"))","v":""},{"$f":"IF(COUNTIF(tbl_OPAOINN_P2Cop27[Copayment],tbl_OPAOINN_P2Cop27[[#This Row],[Copayment]])>1,\"Remove Duplicate Entry.\",IF(AND(tbl_OPAOINN_P2Cop27[[#This Row],[Copayment]]<>\"\",tbl_OPAOINN_P2Cop27[[#This Row],[Allowed Claims]]=0),\"Entry not found in Part 1 Table\",IF(AND(OFFSET(tbl_OPAOINN_P2Cop27[[#This Row],[Copayment]],1,0)<>\"Total\",OFFSET(tbl_OPAOINN_P2Cop27[[#This Row],[Copayment]],1,0)<>\"\",OFFSET(tbl_OPAOINN_P2Cop27[[#This Row],[Copayment]],1,0)<tbl_OPAOINN_P2Cop27[[#This Row],[Copayment]]),\"Sort Entries from lowest to highest\",\"\")))","v":""},null,null,null,null,null,{"$f":"SUMIF(tbl_OPOON_P130[Copayment],BD95,tbl_OPOON_P130[Plan Projected Allowed Amount])","v":0},{"$f":"IF(OR(BE95=0,BE95=\"\"),\"\",BE95/tbl_OPOON_P2Cop32[[#Totals],[Allowed Claims]])","v":""},{"$f":"IF(BF95=\"\",\"\",IF(SUMIF(tbl_OPOON_P2Cop32[Copayment],\">=\"&BD95,tbl_OPOON_P2Cop32[Portion])>0.5,BD95,\"\"))","v":""},{"$f":"IF(COUNTIF(tbl_OPOON_P2Cop32[Copayment],tbl_OPOON_P2Cop32[[#This Row],[Copayment]])>1,\"Remove Duplicate Entry.\",IF(AND(tbl_OPOON_P2Cop32[[#This Row],[Copayment]]<>\"\",tbl_OPOON_P2Cop32[[#This Row],[Allowed Claims]]=0),\"Entry not found in Part 1 Table\",IF(AND(OFFSET(tbl_OPOON_P2Cop32[[#This Row],[Copayment]],1,0)<>\"Total\",OFFSET(tbl_OPOON_P2Cop32[[#This Row],[Copayment]],1,0)<>\"\",OFFSET(tbl_OPOON_P2Cop32[[#This Row],[Copayment]],1,0)<tbl_OPOON_P2Cop32[[#This Row],[Copayment]]),\"Sort Entries from lowest to highest\",\"\")))","v":""},null,null,null,null,null,{"$f":"SUMIF(tbl_OPOVOON_P135[Copayment],BM95,tbl_OPOVOON_P135[Plan Projected Allowed Amount])","v":0},{"$f":"IF(OR(BN95=0,BN95=\"\"),\"\",BN95/tbl_OPOVOON_P2Cop37[[#Totals],[Allowed Claims]])","v":""},{"$f":"IF(BO95=\"\",\"\",IF(SUMIF(tbl_OPOVOON_P2Cop37[Copayment],\">=\"&BM95,tbl_OPOVOON_P2Cop37[Portion])>0.5,BM95,\"\"))","v":""},{"$f":"IF(COUNTIF(tbl_OPOVOON_P2Cop37[Copayment],tbl_OPOVOON_P2Cop37[[#This Row],[Copayment]])>1,\"Remove Duplicate Entry.\",IF(AND(tbl_OPOVOON_P2Cop37[[#This Row],[Copayment]]<>\"\",tbl_OPOVOON_P2Cop37[[#This Row],[Allowed Claims]]=0),\"Entry not found in Part 1 Table\",IF(AND(OFFSET(tbl_OPOVOON_P2Cop37[[#This Row],[Copayment]],1,0)<>\"Total\",OFFSET(tbl_OPOVOON_P2Cop37[[#This Row],[Copayment]],1,0)<>\"\",OFFSET(tbl_OPOVOON_P2Cop37[[#This Row],[Copayment]],1,0)<tbl_OPOVOON_P2Cop37[[#This Row],[Copayment]]),\"Sort Entries from lowest to highest\",\"\")))","v":""},null,null,null,null,null,{"$f":"SUMIF(tbl_OPAOOON_P140[Copayment],BV95,tbl_OPAOOON_P140[Plan Projected Allowed Amount])","v":0},{"$f":"IF(OR(BW95=0,BW95=\"\"),\"\",BW95/tbl_OPAOOON_P2Cop42[[#Totals],[Allowed Claims]])","v":""},{"$f":"IF(BX95=\"\",\"\",IF(SUMIF(tbl_OPAOOON_P2Cop42[Copayment],\">=\"&BV95,tbl_OPAOOON_P2Cop42[Portion])>0.5,BV95,\"\"))","v":""},{"$f":"IF(COUNTIF(tbl_OPAOOON_P2Cop42[Copayment],tbl_OPAOOON_P2Cop42[[#This Row],[Copayment]])>1,\"Remove Duplicate Entry.\",IF(AND(tbl_OPAOOON_P2Cop42[[#This Row],[Copayment]]<>\"\",tbl_OPAOOON_P2Cop42[[#This Row],[Allowed Claims]]=0),\"Entry not found in Part 1 Table\",IF(AND(OFFSET(tbl_OPAOOON_P2Cop42[[#This Row],[Copayment]],1,0)<>\"Total\",OFFSET(tbl_OPAOOON_P2Cop42[[#This Row],[Copayment]],1,0)<>\"\",OFFSET(tbl_OPAOOON_P2Cop42[[#This Row],[Copayment]],1,0)<tbl_OPAOOON_P2Cop42[[#This Row],[Copayment]]),\"Sort Entries from lowest to highest\",\"\")))","v":""},null,null,null,null,null,{"$f":"SUMIF(tbl_ER_P145[Copayment],CE95,tbl_ER_P145[Plan Projected Allowed Amount])","v":0},{"$f":"IF(OR(CF95=0,CF95=\"\"),\"\",CF95/tbl_ER_P2Cop46[[#Totals],[Allowed Claims]])","v":""},{"$f":"IF(CG95=\"\",\"\",IF(SUMIF(tbl_ER_P2Cop46[Copayment],\">=\"&CE95,tbl_ER_P2Cop46[Portion])>0.5,CE95,\"\"))","v":""},{"$f":"IF(COUNTIF(tbl_ER_P2Cop46[Copayment],tbl_ER_P2Cop46[[#This Row],[Copayment]])>1,\"Remove Duplicate Entry.\",IF(AND(tbl_ER_P2Cop46[[#This Row],[Copayment]]<>\"\",tbl_ER_P2Cop46[[#This Row],[Allowed Claims]]=0),\"Entry not found in Part 1 Table\",IF(AND(OFFSET(tbl_ER_P2Cop46[[#This Row],[Copayment]],1,0)<>\"Total\",OFFSET(tbl_ER_P2Cop46[[#This Row],[Copayment]],1,0)<>\"\",OFFSET(tbl_ER_P2Cop46[[#This Row],[Copayment]],1,0)<tbl_ER_P2Cop46[[#This Row],[Copayment]]),\"Sort Entries from lowest to highest\",\"\")))","v":""},null,null,null,null,null,{"$f":"SUMIF(tbl_RX_P149[Copayment],CN95,tbl_RX_P149[Plan Projected Allowed Amount])","v":0},{"$f":"IF(OR(CO95=0,CO95=\"\"),\"\",CO95/tbl_RX_P2Cop51[[#Totals],[Allowed Claims]])","v":""},{"$f":"IF(CP95=\"\",\"\",IF(SUMIF(tbl_RX_P2Cop51[Copayment],\">=\"&CN95,tbl_RX_P2Cop51[Portion])>0.5,CN95,\"\"))","v":""},{"$f":"IF(COUNTIF(tbl_RX_P2Cop51[Copayment],tbl_RX_P2Cop51[[#This Row],[Copayment]])>1,\"Remove Duplicate Entry.\",IF(AND(tbl_RX_P2Cop51[[#This Row],[Copayment]]<>\"\",tbl_RX_P2Cop51[[#This Row],[Allowed Claims]]=0),\"Entry not found in Part 1 Table\",IF(AND(OFFSET(tbl_RX_P2Cop51[[#This Row],[Copayment]],1,0)<>\"Total\",OFFSET(tbl_RX_P2Cop51[[#This Row],[Copayment]],1,0)<>\"\",OFFSET(tbl_RX_P2Cop51[[#This Row],[Copayment]],1,0)<tbl_RX_P2Cop51[[#This Row],[Copayment]]),\"Sort Entries from lowest to highest\",\"\")))","v":""}]
[null,null,null,null,null,null,null,null,null,null,46,{"$f":"SUMIF(tbl_IPINN_P15[Copayment],K96,tbl_IPINN_P15[Plan Projected Allowed Amount])","v":0},{"$f":"IF(OR(L96=0,L96=\"\"),\"\",L96/tbl_IPINN_P2Cop7[[#Totals],[Allowed Claims]])","v":""},{"$f":"IF(M96=\"\",\"\",IF(SUMIF(tbl_IPINN_P2Cop7[Copayment],\">=\"&K96,tbl_IPINN_P2Cop7[Portion])>0.5,K96,\"\"))","v":""},{"$f":"IF(COUNTIF(tbl_IPINN_P2Cop7[Copayment],tbl_IPINN_P2Cop7[[#This Row],[Copayment]])>1,\"Remove Duplicate Entry.\",IF(AND(tbl_IPINN_P2Cop7[[#This Row],[Copayment]]<>\"\",tbl_IPINN_P2Cop7[[#This Row],[Allowed Claims]]=0),\"Entry not found in Part 1 Table\",IF(AND(OFFSET(tbl_IPINN_P2Cop7[[#This Row],[Copayment]],1,0)<>\"Total\",OFFSET(tbl_IPINN_P2Cop7[[#This Row],[Copayment]],1,0)<>\"\",OFFSET(tbl_IPINN_P2Cop7[[#This Row],[Copayment]],1,0)<tbl_IPINN_P2Cop7[[#This Row],[Copayment]]),\"Sort Entries from lowest to highest\",\"\")))","v":"Entry not found in Part 1 Table"},null,null,null,null,"Total",{"$f":"SUBTOTAL(109,tbl_IPOON_P2Cop12[Allowed Claims])","v":621},{"$f":"SUBTOTAL(109,tbl_IPOON_P2Cop12[Portion])","v":1},null,{"$f":"IF(AND(tbl_IPOON_P2Cop12[[#Totals],[Allowed Claims]]<U72,W72<>\"Fail\",W72<>\"N/A\"),\"Add missing cost share values.\",IF(U96>V57,\"Allowed claims higher than possible; correct entries.\",\"\"))","v":""},null,null,null,null,"Total",{"$f":"SUBTOTAL(109,tbl_OPINN_P2Cop17[Allowed Claims])","v":0},{"$f":"SUBTOTAL(109,tbl_OPINN_P2Cop17[Portion])","v":0},null,{"$f":"IF(AND(tbl_OPINN_P2Cop17[[#Totals],[Allowed Claims]]<AD72,AF72<>\"Fail\",AF72<>\"N/A\"),\"Add missing cost share values.\",IF(AD96>AE55,\"Allowed claims higher than possible; correct entries.\",\"\"))","v":""},null,null,null,null,"Total",{"$f":"SUBTOTAL(109,tbl_OPOVINN_P2Cop22[Allowed Claims])","v":0},{"$f":"SUBTOTAL(109,tbl_OPOVINN_P2Cop22[Portion])","v":0},null,{"$f":"IF(AND(tbl_OPOVINN_P2Cop22[[#Totals],[Allowed Claims]]<AM72,AO72<>\"Fail\",AO72<>\"N/A\"),\"Add missing cost share values.\",IF(AM96>AN55,\"Allowed claims higher than possible; correct entries.\",\"\"))","v":""},null,null,null,null,"Total",{"$f":"SUBTOTAL(109,tbl_OPAOINN_P2Cop27[Allowed Claims])","v":0},{"$f":"SUBTOTAL(109,tbl_OPAOINN_P2Cop27[Portion])","v":0},null,{"$f":"IF(AND(tbl_OPAOINN_P2Cop27[[#Totals],[Allowed Claims]]<AV72,AX72<>\"Fail\",AX72<>\"N/A\"),\"Add missing cost share values.\",IF(AV96>AW55,\"Allowed claims higher than possible; correct entries.\",\"\"))","v":""},null,null,null,null,"Total",{"$f":"SUBTOTAL(109,tbl_OPOON_P2Cop32[Allowed Claims])","v":0},{"$f":"SUBTOTAL(109,tbl_OPOON_P2Cop32[Portion])","v":0},null,{"$f":"IF(AND(tbl_OPOON_P2Cop32[[#Totals],[Allowed Claims]]<BE72,BG72<>\"Fail\",BG72<>\"N/A\"),\"Add missing cost share values.\",IF(BE96>BF55,\"Allowed claims higher than possible; correct entries.\",\"\"))","v":""},null,null,null,null,"Total",{"$f":"SUBTOTAL(109,tbl_OPOVOON_P2Cop37[Allowed Claims])","v":0},{"$f":"SUBTOTAL(109,tbl_OPOVOON_P2Cop37[Portion])","v":0},null,{"$f":"IF(AND(tbl_OPOVOON_P2Cop37[[#Totals],[Allowed Claims]]<BN72,BP72<>\"Fail\",BP72<>\"N/A\"),\"Add missing cost share values.\",IF(BN96>BO55,\"Allowed claims higher than possible; correct entries.\",\"\"))","v":""},null,null,null,null,"Total",{"$f":"SUBTOTAL(109,tbl_OPAOOON_P2Cop42[Allowed Claims])","v":0},{"$f":"SUBTOTAL(109,tbl_OPAOOON_P2Cop42[Portion])","v":0},null,{"$f":"IF(AND(tbl_OPAOOON_P2Cop42[[#Totals],[Allowed Claims]]<BW72,BY72<>\"Fail\",BY72<>\"N/A\"),\"Add missing cost share values.\",IF(BW96>BX55,\"Allowed claims higher than possible; correct entries.\",\"\"))","v":""},null,null,null,null,"Total",{"$f":"SUBTOTAL(109,tbl_ER_P2Cop46[Allowed Claims])","v":0},{"$f":"SUBTOTAL(109,tbl_ER_P2Cop46[Portion])","v":0},null,{"$f":"IF(AND(tbl_ER_P2Cop46[[#Totals],[Allowed Claims]]<CF72,CH72<>\"Fail\",CH72<>\"N/A\"),\"Add missing cost share values.\",IF(CF96>CG55,\"Allowed claims higher than possible; correct entries.\",\"\"))","v":""},null,null,null,null,"Total",{"$f":"SUBTOTAL(109,tbl_RX_P2Cop51[Allowed Claims])","v":0},{"$f":"SUBTOTAL(109,tbl_RX_P2Cop51[Portion])","v":0},null,{"$f":"IF(AND(tbl_RX_P2Cop51[[#Totals],[Allowed Claims]]<CO72,CQ72<>\"Fail\",CQ72<>\"N/A\"),\"Add missing cost share values.\",IF(CO96>CP55,\"Allowed claims higher than possible; correct entries.\",\"\"))","v":""}]
[null,null,null,null,null,null,null,null,null,null,"Total",{"$f":"SUBTOTAL(109,tbl_IPINN_P2Cop7[Allowed Claims])","v":3454},{"$f":"SUBTOTAL(109,tbl_IPINN_P2Cop7[Portion])","v":1},null,{"$f":"IF(AND(tbl_IPINN_P2Cop7[[#Totals],[Allowed Claims]]<L72,N72<>\"Fail\",N72<>\"N/A\"),\"Add missing cost share values.\",IF(L97>M55,\"Allowed claims higher than possible; correct entries.\",\"\"))","v":"Allowed claims higher than possible; correct entries."}]
[null,null,null,null,null,null,null,null,null,null,null,null,null,null,null,null,null,null,null,{"$f":"T102&\" ---- \"&U$40","v":"Coinsurance ---- (2) Inpatient, Out-of-Network (IP OON)"},null,null,"Errors found:",{"$f":"COUNTIF(tbl_IPOON_P2Coi13[[#Data],[#Totals],[Error Checking]],\"?*\")","v":0},null,null,null,null,{"$f":"AC102&\" ---- \"&AD$40","v":"Coinsurance ---- (3) Outpatient, In-Network (OP INN)"},null,null,"Errors found:",{"$f":"COUNTIF(tbl_OPINN_P2Coi18[[#Data],[#Totals],[Error Checking]],\"?*\")","v":0},null,null,null,null,{"$f":"AL102&\" ---- \"&AM$40","v":"Coinsurance ---- (3a) Outpatient - Office Visits, In-Network (OP-OV INN)"},null,null,"Errors found:",{"$f":"COUNTIF(tbl_OPOVINN_P2Coi23[[#Data],[#Totals],[Error Checking]],\"?*\")","v":0},null,null,null,null,{"$f":"AU102&\" ---- \"&AV$40","v":"Coinsurance ---- (3b) Outpatient - All Other, In-Network (OP-AO INN)"},null,null,"Errors found:",{"$f":"COUNTIF(tbl_OPAOINN_P2Coi28[[#Data],[#Totals],[Error Checking]],\"?*\")","v":0},null,null,null,null,{"$f":"BD102&\" ---- \"&BE$40","v":"Coinsurance ---- (4) Outpatient, Out-of-Network (OP OON)"},null,null,"Errors found:",{"$f":"COUNTIF(tbl_OPOON_P2Coi33[[#Data],[#Totals],[Error Checking]],\"?*\")","v":0},null,null,null,null,{"$f":"BM102&\" ---- \"&BN$40","v":"Coinsurance ---- (4a) Outpatient - Office Visits, Out-of-Network (OP-OV OON)"},null,null,"Errors found:",{"$f":"COUNTIF(tbl_OPOVOON_P2Coi38[[#Data],[#Totals],[Error Checking]],\"?*\")","v":0},null,null,null,null,{"$f":"BV102&\" ---- \"&BW$40","v":"Coinsurance ---- (4b) Outpatient - All Other, Out-of-Network (OP-AO OON)"},null,null,"Errors found:",{"$f":"COUNTIF(tbl_OPAOOON_P2Coi43[[#Data],[#Totals],[Error Checking]],\"?*\")","v":0},null,null,null,null,{"$f":"CE102&\" ---- \"&CF$40","v":"Coinsurance ---- (5) Emergency Care,  (ER )"},null,null,"Errors found:",{"$f":"COUNTIF(tbl_ER_P2Coi47[[#Data],[#Totals],[Error Checking]],\"?*\")","v":0},null,null,null,null,{"$f":"CN102&\" ---- \"&CO$40","v":"Coinsurance ---- (6) Prescription Drugs,  (RX )"},null,null,"Errors found:",{"$f":"COUNTIF(tbl_RX_P2Coi52[[#Data],[#Totals],[Error Checking]],\"?*\")","v":0}]
[null,null,null,null,null,null,null,null,null,null,{"$f":"K103&\" ---- \"&L$40","v":"Coinsurance ---- (1) Inpatient, In-Network (IP INN)"},null,null,"Errors found:",{"$f":"COUNTIF(tbl_IPINN_P2Coi8[[#Data],[#Totals],[Error Checking]],\"?*\")","v":1},null,null,null,null,{"$f":"IF(INDEX(V$71:V$74,MATCH(T102,T$71:T$74,0))=\"\",\"If testing is required for this benefit classification: \nPlease ensure each different cost-share combination is entered above in PART 1.\",IF(INDEX(V$71:V$74,MATCH(T102,T$71:T$74,0))>=(2/3),\"Applies to substantially all medical/surgical benefits in this classification.\nENTER different \"&LOWER(T102)&\" amounts from smallest to largest.\",\"Does not apply to substantially all medical/surgical benefits in this classification. \nDELETE any values in the left-hand column below.\"))","v":"Does not apply to substantially all medical/surgical benefits in this classification. \nDELETE any values in the left-hand column below."},null,null,null,null,null,null,null,null,{"$f":"IF(INDEX(AE$71:AE$74,MATCH(AC102,AC$71:AC$74,0))=\"\",\"If testing is required for this benefit classification: \nPlease ensure each different cost-share combination is entered above in PART 1.\",IF(INDEX(AE$71:AE$74,MATCH(AC102,AC$71:AC$74,0))>=(2/3),\"Applies to substantially all medical/surgical benefits in this classification.\nENTER different \"&LOWER(AC102)&\" amounts from smallest to largest.\",\"Does not apply to substantially all medical/surgical benefits in this classification. \nDELETE any values in the left-hand column below.\"))","v":"If testing is required for this benefit classification: \nPlease ensure each different cost-share combination is entered above in PART 1."},null,null,null,null,null,null,null,null,{"$f":"IF(INDEX(AN$71:AN$74,MATCH(AL102,AL$71:AL$74,0))=\"\",\"If testing is required for this benefit classification: \nPlease ensure each different cost-share combination is entered above in PART 1.\",IF(INDEX(AN$71:AN$74,MATCH(AL102,AL$71:AL$74,0))>=(2/3),\"Applies to substantially all medical/surgical benefits in this classification.\nENTER different \"&LOWER(AL102)&\" amounts from smallest to largest.\",\"Does not apply to substantially all medical/surgical benefits in this classification. \nDELETE any values in the left-hand column below.\"))","v":"If testing is required for this benefit classification: \nPlease ensure each different cost-share combination is entered above in PART 1."},null,null,null,null,null,null,null,null,{"$f":"IF(INDEX(AW$71:AW$74,MATCH(AU102,AU$71:AU$74,0))=\"\",\"If testing is required for this benefit classification: \nPlease ensure each different cost-share combination is entered above in PART 1.\",IF(INDEX(AW$71:AW$74,MATCH(AU102,AU$71:AU$74,0))>=(2/3),\"Applies to substantially all medical/surgical benefits in this classification.\nENTER different \"&LOWER(AU102)&\" amounts from smallest to largest.\",\"Does not apply to substantially all medical/surgical benefits in this classification. \nDELETE any values in the left-hand column below.\"))","v":"If testing is required for this benefit classification: \nPlease ensure each different cost-share combination is entered above in PART 1."},null,null,null,null,null,null,null,null,{"$f":"IF(INDEX(BF$71:BF$74,MATCH(BD102,BD$71:BD$74,0))=\"\",\"If testing is required for this benefit classification: \nPlease ensure each different cost-share combination is entered above in PART 1.\",IF(INDEX(BF$71:BF$74,MATCH(BD102,BD$71:BD$74,0))>=(2/3),\"Applies to substantially all medical/surgical benefits in this classification.\nENTER different \"&LOWER(BD102)&\" amounts from smallest to largest.\",\"Does not apply to substantially all medical/surgical benefits in this classification. \nDELETE any values in the left-hand column below.\"))","v":"If testing is required for this benefit classification: \nPlease ensure each different cost-share combination is entered above in PART 1."},null,null,null,null,null,null,null,null,{"$f":"IF(INDEX(BO$71:BO$74,MATCH(BM102,BM$71:BM$74,0))=\"\",\"If testing is required for this benefit classification: \nPlease ensure each different cost-share combination is entered above in PART 1.\",IF(INDEX(BO$71:BO$74,MATCH(BM102,BM$71:BM$74,0))>=(2/3),\"Applies to substantially all medical/surgical benefits in this classification.\nENTER different \"&LOWER(BM102)&\" amounts from smallest to largest.\",\"Does not apply to substantially all medical/surgical benefits in this classification. \nDELETE any values in the left-hand column below.\"))","v":"If testing is required for this benefit classification: \nPlease ensure each different cost-share combination is entered above in PART 1."},null,null,null,null,null,null,null,null,{"$f":"IF(INDEX(BX$71:BX$74,MATCH(BV102,BV$71:BV$74,0))=\"\",\"If testing is required for this benefit classification: \nPlease ensure each different cost-share combination is entered above in PART 1.\",IF(INDEX(BX$71:BX$74,MATCH(BV102,BV$71:BV$74,0))>=(2/3),\"Applies to substantially all medical/surgical benefits in this classification.\nENTER different \"&LOWER(BV102)&\" amounts from smallest to largest.\",\"Does not apply to substantially all medical/surgical benefits in this classification. \nDELETE any values in the left-hand column below.\"))","v":"If testing is required for this benefit classification: \nPlease ensure each different cost-share combination is entered above in PART 1."},null,null,null,null,null,null,null,null,{"$f":"IF(INDEX(CG$71:CG$74,MATCH(CE102,CE$71:CE$74,0))=\"\",\"If testing is required for this benefit classification: \nPlease ensure each different cost-share combination is entered above in PART 1.\",IF(INDEX(CG$71:CG$74,MATCH(CE102,CE$71:CE$74,0))>=(2/3),\"Applies to substantially all medical/surgical benefits in this classification.\nENTER different \"&LOWER(CE102)&\" amounts from smallest to largest.\",\"Does not apply to substantially all medical/surgical benefits in this classification. \nDELETE any values in the left-hand column below.\"))","v":"If testing is required for this benefit classification: \nPlease ensure each different cost-share combination is entered above in PART 1."},null,null,null,null,null,null,null,null,{"$f":"IF(INDEX(CP$71:CP$74,MATCH(CN102,CN$71:CN$74,0))=\"\",\"If testing is required for this benefit classification: \nPlease ensure each different cost-share combination is entered above in PART 1.\",IF(INDEX(CP$71:CP$74,MATCH(CN102,CN$71:CN$74,0))>=(2/3),\"Applies to substantially all medical/surgical benefits in this classification.\nENTER different \"&LOWER(CN102)&\" amounts from smallest to largest.\",\"Does not apply to substantially all medical/surgical benefits in this classification. \nDELETE any values in the left-hand column below.\"))","v":"If testing is required for this benefit classification: \nPlease ensure each different cost-share combination is entered above in PART 1."}]
[null,null,null,null,null,null,null,null,null,null,{"$f":"IF(INDEX(M$71:M$74,MATCH(K103,K$71:K$74,0))=\"\",\"If testing is required for this benefit classification: \nPlease ensure each different cost-share combination is entered above in PART 1.\",IF(INDEX(M$71:M$74,MATCH(K103,K$71:K$74,0))>=(2/3),\"Applies to substantially all medical/surgical benefits in this classification.\nENTER different \"&LOWER(K103)&\" amounts from smallest to largest.\",\"Does not apply to substantially all medical/surgical benefits in this classification. \nDELETE any values in the left-hand column below.\"))","v":"Does not apply to substantially all medical/surgical benefits in this classification. \nDELETE any values in the left-hand column below."}]
[]
[null,null,null,null,null,null,null,null,null,null,null,null,null,null,null,null,null,null,null,"Coinsurance","Allowed Claims","Portion","Predominant & Smaller","Error Checking",null,null,null,null,"Coinsurance","Allowed Claims","Portion","Predominant & Smaller","Error Checking",null,null,null,null,"Coinsurance","Allowed Claims","Portion","Predominant & Smaller","Error Checking",null,null,null,null,"Coinsurance","Allowed Claims","Portion","Predominant & Smaller","Error Checking",null,null,null,null,"Coinsurance","Allowed Claims","Portion","Predominant & Smaller","Error Checking",null,null,null,null,"Coinsurance","Allowed Claims","Portion","Predominant & Smaller","Error Checking",null,null,null,null,"Coinsurance","Allowed Claims","Portion","Predominant & Smaller","Error Checking",null,null,null,null,"Coinsurance","Allowed Claims","Portion","Predominant & Smaller","Error Checking",null,null,null,null,"Coinsurance","Allowed Claims","Portion","Predominant & Smaller","Error Checking"]
[null,null,null,null,null,null,null,null,null,null,"Coinsurance","Allowed Claims","Portion","Predominant & Smaller","Error Checking",null,null,null,null,null,{"$f":"SUMIF(tbl_IPOON_P110[Coinsurance],T103,tbl_IPOON_P110[Plan Projected Allowed Amount])","v":0},{"$f":"IF(OR(U103=0,U103=\"\"),\"\",U103/tbl_IPOON_P2Coi13[[#Totals],[Allowed Claims]])","v":""},{"$f":"IF(V103=\"\",\"\",IF(SUMIF(tbl_IPOON_P2Coi13[Coinsurance],\">=\"&T103,tbl_IPOON_P2Coi13[Portion])>0.5,T103,\"\"))","v":""},{"$f":"IF(COUNTIF(tbl_IPOON_P2Coi13[Coinsurance],tbl_IPOON_P2Coi13[[#This Row],[Coinsurance]])>1,\"Remove Duplicate Entry.\",IF(AND(tbl_IPOON_P2Coi13[[#This Row],[Coinsurance]]<>\"\",tbl_IPOON_P2Coi13[[#This Row],[Allowed Claims]]=0),\"Entry not found in Part 1 Table\",IF(AND(OFFSET(tbl_IPOON_P2Coi13[[#This Row],[Coinsurance]],1,0)<>\"Total\",OFFSET(tbl_IPOON_P2Coi13[[#This Row],[Coinsurance]],1,0)<>\"\",OFFSET(tbl_IPOON_P2Coi13[[#This Row],[Coinsurance]],1,0)<tbl_IPOON_P2Coi13[[#This Row],[Coinsurance]]),\"Sort Entries from lowest to highest\",\"\")))","v":""},null,null,null,null,null,{"$f":"SUMIF(tbl_OPINN_P115[Coinsurance],AC103,tbl_OPINN_P115[Plan Projected Allowed Amount])","v":0},{"$f":"IF(OR(AD103=0,AD103=\"\"),\"\",AD103/tbl_OPINN_P2Coi18[[#Totals],[Allowed Claims]])","v":""},{"$f":"IF(AE103=\"\",\"\",IF(SUMIF(tbl_OPINN_P2Coi18[Coinsurance],\">=\"&AC103,tbl_OPINN_P2Coi18[Portion])>0.5,AC103,\"\"))","v":""},{"$f":"IF(COUNTIF(tbl_OPINN_P2Coi18[Coinsurance],tbl_OPINN_P2Coi18[[#This Row],[Coinsurance]])>1,\"Remove Duplicate Entry.\",IF(AND(tbl_OPINN_P2Coi18[[#This Row],[Coinsurance]]<>\"\",tbl_OPINN_P2Coi18[[#This Row],[Allowed Claims]]=0),\"Entry not found in Part 1 Table\",IF(AND(OFFSET(tbl_OPINN_P2Coi18[[#This Row],[Coinsurance]],1,0)<>\"Total\",OFFSET(tbl_OPINN_P2Coi18[[#This Row],[Coinsurance]],1,0)<>\"\",OFFSET(tbl_OPINN_P2Coi18[[#This Row],[Coinsurance]],1,0)<tbl_OPINN_P2Coi18[[#This Row],[Coinsurance]]),\"Sort Entries from lowest to highest\",\"\")))","v":""},null,null,null,null,null,{"$f":"SUMIF(tbl_OPOVINN_P120[Coinsurance],AL103,tbl_OPOVINN_P120[Plan Projected Allowed Amount])","v":0},{"$f":"IF(OR(AM103=0,AM103=\"\"),\"\",AM103/tbl_OPOVINN_P2Coi23[[#Totals],[Allowed Claims]])","v":""},{"$f":"IF(AN103=\"\",\"\",IF(SUMIF(tbl_OPOVINN_P2Coi23[Coinsurance],\">=\"&AL103,tbl_OPOVINN_P2Coi23[Portion])>0.5,AL103,\"\"))","v":""},{"$f":"IF(COUNTIF(tbl_OPOVINN_P2Coi23[Coinsurance],tbl_OPOVINN_P2Coi23[[#This Row],[Coinsurance]])>1,\"Remove Duplicate Entry.\",IF(AND(tbl_OPOVINN_P2Coi23[[#This Row],[Coinsurance]]<>\"\",tbl_OPOVINN_P2Coi23[[#This Row],[Allowed Claims]]=0),\"Entry not found in Part 1 Table\",IF(AND(OFFSET(tbl_OPOVINN_P2Coi23[[#This Row],[Coinsurance]],1,0)<>\"Total\",OFFSET(tbl_OPOVINN_P2Coi23[[#This Row],[Coinsurance]],1,0)<>\"\",OFFSET(tbl_OPOVINN_P2Coi23[[#This Row],[Coinsurance]],1,0)<tbl_OPOVINN_P2Coi23[[#This Row],[Coinsurance]]),\"Sort Entries from lowest to highest\",\"\")))","v":""},null,null,null,null,null,{"$f":"SUMIF(tbl_OPAOINN_P125[Coinsurance],AU103,tbl_OPAOINN_P125[Plan Projected Allowed Amount])","v":0},{"$f":"IF(OR(AV103=0,AV103=\"\"),\"\",AV103/tbl_OPAOINN_P2Coi28[[#Totals],[Allowed Claims]])","v":""},{"$f":"IF(AW103=\"\",\"\",IF(SUMIF(tbl_OPAOINN_P2Coi28[Coinsurance],\">=\"&AU103,tbl_OPAOINN_P2Coi28[Portion])>0.5,AU103,\"\"))","v":""},{"$f":"IF(COUNTIF(tbl_OPAOINN_P2Coi28[Coinsurance],tbl_OPAOINN_P2Coi28[[#This Row],[Coinsurance]])>1,\"Remove Duplicate Entry.\",IF(AND(tbl_OPAOINN_P2Coi28[[#This Row],[Coinsurance]]<>\"\",tbl_OPAOINN_P2Coi28[[#This Row],[Allowed Claims]]=0),\"Entry not found in Part 1 Table\",IF(AND(OFFSET(tbl_OPAOINN_P2Coi28[[#This Row],[Coinsurance]],1,0)<>\"Total\",OFFSET(tbl_OPAOINN_P2Coi28[[#This Row],[Coinsurance]],1,0)<>\"\",OFFSET(tbl_OPAOINN_P2Coi28[[#This Row],[Coinsurance]],1,0)<tbl_OPAOINN_P2Coi28[[#This Row],[Coinsurance]]),\"Sort Entries from lowest to highest\",\"\")))","v":""},null,null,null,null,null,{"$f":"SUMIF(tbl_OPOON_P130[Coinsurance],BD103,tbl_OPOON_P130[Plan Projected Allowed Amount])","v":0},{"$f":"IF(OR(BE103=0,BE103=\"\"),\"\",BE103/tbl_OPOON_P2Coi33[[#Totals],[Allowed Claims]])","v":""},{"$f":"IF(BF103=\"\",\"\",IF(SUMIF(tbl_OPOON_P2Coi33[Coinsurance],\">=\"&BD103,tbl_OPOON_P2Coi33[Portion])>0.5,BD103,\"\"))","v":""},{"$f":"IF(COUNTIF(tbl_OPOON_P2Coi33[Coinsurance],tbl_OPOON_P2Coi33[[#This Row],[Coinsurance]])>1,\"Remove Duplicate Entry.\",IF(AND(tbl_OPOON_P2Coi33[[#This Row],[Coinsurance]]<>\"\",tbl_OPOON_P2Coi33[[#This Row],[Allowed Claims]]=0),\"Entry not found in Part 1 Table\",IF(AND(OFFSET(tbl_OPOON_P2Coi33[[#This Row],[Coinsurance]],1,0)<>\"Total\",OFFSET(tbl_OPOON_P2Coi33[[#This Row],[Coinsurance]],1,0)<>\"\",OFFSET(tbl_OPOON_P2Coi33[[#This Row],[Coinsurance]],1,0)<tbl_OPOON_P2Coi33[[#This Row],[Coinsurance]]),\"Sort Entries from lowest to highest\",\"\")))","v":""},null,null,null,null,null,{"$f":"SUMIF(tbl_OPOVOON_P135[Coinsurance],BM103,tbl_OPOVOON_P135[Plan Projected Allowed Amount])","v":0},{"$f":"IF(OR(BN103=0,BN103=\"\"),\"\",BN103/tbl_OPOVOON_P2Coi38[[#Totals],[Allowed Claims]])","v":""},{"$f":"IF(BO103=\"\",\"\",IF(SUMIF(tbl_OPOVOON_P2Coi38[Coinsurance],\">=\"&BM103,tbl_OPOVOON_P2Coi38[Portion])>0.5,BM103,\"\"))","v":""},{"$f":"IF(COUNTIF(tbl_OPOVOON_P2Coi38[Coinsurance],tbl_OPOVOON_P2Coi38[[#This Row],[Coinsurance]])>1,\"Remove Duplicate Entry.\",IF(AND(tbl_OPOVOON_P2Coi38[[#This Row],[Coinsurance]]<>\"\",tbl_OPOVOON_P2Coi38[[#This Row],[Allowed Claims]]=0),\"Entry not found in Part 1 Table\",IF(AND(OFFSET(tbl_OPOVOON_P2Coi38[[#This Row],[Coinsurance]],1,0)<>\"Total\",OFFSET(tbl_OPOVOON_P2Coi38[[#This Row],[Coinsurance]],1,0)<>\"\",OFFSET(tbl_OPOVOON_P2Coi38[[#This Row],[Coinsurance]],1,0)<tbl_OPOVOON_P2Coi38[[#This Row],[Coinsurance]]),\"Sort Entries from lowest to highest\",\"\")))","v":""},null,null,null,null,null,{"$f":"SUMIF(tbl_OPAOOON_P140[Coinsurance],BV103,tbl_OPAOOON_P140[Plan Projected Allowed Amount])","v":0},{"$f":"IF(OR(BW103=0,BW103=\"\"),\"\",BW103/tbl_OPAOOON_P2Coi43[[#Totals],[Allowed Claims]])","v":""},{"$f":"IF(BX103=\"\",\"\",IF(SUMIF(tbl_OPAOOON_P2Coi43[Coinsurance],\">=\"&BV103,tbl_OPAOOON_P2Coi43[Portion])>0.5,BV103,\"\"))","v":""},{"$f":"IF(COUNTIF(tbl_OPAOOON_P2Coi43[Coinsurance],tbl_OPAOOON_P2Coi43[[#This Row],[Coinsurance]])>1,\"Remove Duplicate Entry.\",IF(AND(tbl_OPAOOON_P2Coi43[[#This Row],[Coinsurance]]<>\"\",tbl_OPAOOON_P2Coi43[[#This Row],[Allowed Claims]]=0),\"Entry not found in Part 1 Table\",IF(AND(OFFSET(tbl_OPAOOON_P2Coi43[[#This Row],[Coinsurance]],1,0)<>\"Total\",OFFSET(tbl_OPAOOON_P2Coi43[[#This Row],[Coinsurance]],1,0)<>\"\",OFFSET(tbl_OPAOOON_P2Coi43[[#This Row],[Coinsurance]],1,0)<tbl_OPAOOON_P2Coi43[[#This Row],[Coinsurance]]),\"Sort Entries from lowest to highest\",\"\")))","v":""},null,null,null,null,null,{"$f":"SUMIF(tbl_ER_P145[Coinsurance],CE103,tbl_ER_P145[Plan Projected Allowed Amount])","v":0},{"$f":"IF(OR(CF103=0,CF103=\"\"),\"\",CF103/tbl_ER_P2Coi47[[#Totals],[Allowed Claims]])","v":""},{"$f":"IF(CG103=\"\",\"\",IF(SUMIF(tbl_ER_P2Coi47[Coinsurance],\">=\"&CE103,tbl_ER_P2Coi47[Portion])>0.5,CE103,\"\"))","v":""},{"$f":"IF(COUNTIF(tbl_ER_P2Coi47[Coinsurance],tbl_ER_P2Coi47[[#This Row],[Coinsurance]])>1,\"Remove Duplicate Entry.\",IF(AND(tbl_ER_P2Coi47[[#This Row],[Coinsurance]]<>\"\",tbl_ER_P2Coi47[[#This Row],[Allowed Claims]]=0),\"Entry not found in Part 1 Table\",IF(AND(OFFSET(tbl_ER_P2Coi47[[#This Row],[Coinsurance]],1,0)<>\"Total\",OFFSET(tbl_ER_P2Coi47[[#This Row],[Coinsurance]],1,0)<>\"\",OFFSET(tbl_ER_P2Coi47[[#This Row],[Coinsurance]],1,0)<tbl_ER_P2Coi47[[#This Row],[Coinsurance]]),\"Sort Entries from lowest to highest\",\"\")))","v":""},null,null,null,null,null,{"$f":"SUMIF(tbl_RX_P149[Coinsurance],CN103,tbl_RX_P149[Plan Projected Allowed Amount])","v":0},{"$f":"IF(OR(CO103=0,CO103=\"\"),\"\",CO103/tbl_RX_P2Coi52[[#Totals],[Allowed Claims]])","v":""},{"$f":"IF(CP103=\"\",\"\",IF(SUMIF(tbl_RX_P2Coi52[Coinsurance],\">=\"&CN103,tbl_RX_P2Coi52[Portion])>0.5,CN103,\"\"))","v":""},{"$f":"IF(COUNTIF(tbl_RX_P2Coi52[Coinsurance],tbl_RX_P2Coi52[[#This Row],[Coinsurance]])>1,\"Remove Duplicate Entry.\",IF(AND(tbl_RX_P2Coi52[[#This Row],[Coinsurance]]<>\"\",tbl_RX_P2Coi52[[#This Row],[Allowed Claims]]=0),\"Entry not found in Part 1 Table\",IF(AND(OFFSET(tbl_RX_P2Coi52[[#This Row],[Coinsurance]],1,0)<>\"Total\",OFFSET(tbl_RX_P2Coi52[[#This Row],[Coinsurance]],1,0)<>\"\",OFFSET(tbl_RX_P2Coi52[[#This Row],[Coinsurance]],1,0)<tbl_RX_P2Coi52[[#This Row],[Coinsurance]]),\"Sort Entries from lowest to highest\",\"\")))","v":""}]
[null,null,null,null,null,null,null,null,null,null,0.2,{"$f":"SUMIF(tbl_IPINN_P15[Coinsurance],K104,tbl_IPINN_P15[Plan Projected Allowed Amount])","v":346},{"$f":"IF(OR(L104=0,L104=\"\"),\"\",L104/tbl_IPINN_P2Coi8[[#Totals],[Allowed Claims]])","v":1},{"$f":"IF(M104=\"\",\"\",IF(SUMIF(tbl_IPINN_P2Coi8[Coinsurance],\">=\"&K104,tbl_IPINN_P2Coi8[Portion])>0.5,K104,\"\"))","v":0.2},{"$f":"IF(COUNTIF(tbl_IPINN_P2Coi8[Coinsurance],tbl_IPINN_P2Coi8[[#This Row],[Coinsurance]])>1,\"Remove Duplicate Entry.\",IF(AND(tbl_IPINN_P2Coi8[[#This Row],[Coinsurance]]<>\"\",tbl_IPINN_P2Coi8[[#This Row],[Allowed Claims]]=0),\"Entry not found in Part 1 Table\",IF(AND(OFFSET(tbl_IPINN_P2Coi8[[#This Row],[Coinsurance]],1,0)<>\"Total\",OFFSET(tbl_IPINN_P2Coi8[[#This Row],[Coinsurance]],1,0)<>\"\",OFFSET(tbl_IPINN_P2Coi8[[#This Row],[Coinsurance]],1,0)<tbl_IPINN_P2Coi8[[#This Row],[Coinsurance]]),\"Sort Entries from lowest to highest\",\"\")))","v":""},null,null,null,null,null,{"$f":"SUMIF(tbl_IPOON_P110[Coinsurance],T104,tbl_IPOON_P110[Plan Projected Allowed Amount])","v":0},{"$f":"IF(OR(U104=0,U104=\"\"),\"\",U104/tbl_IPOON_P2Coi13[[#Totals],[Allowed Claims]])","v":""},{"$f":"IF(V104=\"\",\"\",IF(SUMIF(tbl_IPOON_P2Coi13[Coinsurance],\">=\"&T104,tbl_IPOON_P2Coi13[Portion])>0.5,T104,\"\"))","v":""},{"$f":"IF(COUNTIF(tbl_IPOON_P2Coi13[Coinsurance],tbl_IPOON_P2Coi13[[#This Row],[Coinsurance]])>1,\"Remove Duplicate Entry.\",IF(AND(tbl_IPOON_P2Coi13[[#This Row],[Coinsurance]]<>\"\",tbl_IPOON_P2Coi13[[#This Row],[Allowed Claims]]=0),\"Entry not found in Part 1 Table\",IF(AND(OFFSET(tbl_IPOON_P2Coi13[[#This Row],[Coinsurance]],1,0)<>\"Total\",OFFSET(tbl_IPOON_P2Coi13[[#This Row],[Coinsurance]],1,0)<>\"\",OFFSET(tbl_IPOON_P2Coi13[[#This Row],[Coinsurance]],1,0)<tbl_IPOON_P2Coi13[[#This Row],[Coinsurance]]),\"Sort Entries from lowest to highest\",\"\")))","v":""},null,null,null,null,null,{"$f":"SUMIF(tbl_OPINN_P115[Coinsurance],AC104,tbl_OPINN_P115[Plan Projected Allowed Amount])","v":0},{"$f":"IF(OR(AD104=0,AD104=\"\"),\"\",AD104/tbl_OPINN_P2Coi18[[#Totals],[Allowed Claims]])","v":""},{"$f":"IF(AE104=\"\",\"\",IF(SUMIF(tbl_OPINN_P2Coi18[Coinsurance],\">=\"&AC104,tbl_OPINN_P2Coi18[Portion])>0.5,AC104,\"\"))","v":""},{"$f":"IF(COUNTIF(tbl_OPINN_P2Coi18[Coinsurance],tbl_OPINN_P2Coi18[[#This Row],[Coinsurance]])>1,\"Remove Duplicate Entry.\",IF(AND(tbl_OPINN_P2Coi18[[#This Row],[Coinsurance]]<>\"\",tbl_OPINN_P2Coi18[[#This Row],[Allowed Claims]]=0),\"Entry not found in Part 1 Table\",IF(AND(OFFSET(tbl_OPINN_P2Coi18[[#This Row],[Coinsurance]],1,0)<>\"Total\",OFFSET(tbl_OPINN_P2Coi18[[#This Row],[Coinsurance]],1,0)<>\"\",OFFSET(tbl_OPINN_P2Coi18[[#This Row],[Coinsurance]],1,0)<tbl_OPINN_P2Coi18[[#This Row],[Coinsurance]]),\"Sort Entries from lowest to highest\",\"\")))","v":""},null,null,null,null,null,{"$f":"SUMIF(tbl_OPOVINN_P120[Coinsurance],AL104,tbl_OPOVINN_P120[Plan Projected Allowed Amount])","v":0},{"$f":"IF(OR(AM104=0,AM104=\"\"),\"\",AM104/tbl_OPOVINN_P2Coi23[[#Totals],[Allowed Claims]])","v":""},{"$f":"IF(AN104=\"\",\"\",IF(SUMIF(tbl_OPOVINN_P2Coi23[Coinsurance],\">=\"&AL104,tbl_OPOVINN_P2Coi23[Portion])>0.5,AL104,\"\"))","v":""},{"$f":"IF(COUNTIF(tbl_OPOVINN_P2Coi23[Coinsurance],tbl_OPOVINN_P2Coi23[[#This Row],[Coinsurance]])>1,\"Remove Duplicate Entry.\",IF(AND(tbl_OPOVINN_P2Coi23[[#This Row],[Coinsurance]]<>\"\",tbl_OPOVINN_P2Coi23[[#This Row],[Allowed Claims]]=0),\"Entry not found in Part 1 Table\",IF(AND(OFFSET(tbl_OPOVINN_P2Coi23[[#This Row],[Coinsurance]],1,0)<>\"Total\",OFFSET(tbl_OPOVINN_P2Coi23[[#This Row],[Coinsurance]],1,0)<>\"\",OFFSET(tbl_OPOVINN_P2Coi23[[#This Row],[Coinsurance]],1,0)<tbl_OPOVINN_P2Coi23[[#This Row],[Coinsurance]]),\"Sort Entries from lowest to highest\",\"\")))","v":""},null,null,null,null,null,{"$f":"SUMIF(tbl_OPAOINN_P125[Coinsurance],AU104,tbl_OPAOINN_P125[Plan Projected Allowed Amount])","v":0},{"$f":"IF(OR(AV104=0,AV104=\"\"),\"\",AV104/tbl_OPAOINN_P2Coi28[[#Totals],[Allowed Claims]])","v":""},{"$f":"IF(AW104=\"\",\"\",IF(SUMIF(tbl_OPAOINN_P2Coi28[Coinsurance],\">=\"&AU104,tbl_OPAOINN_P2Coi28[Portion])>0.5,AU104,\"\"))","v":""},{"$f":"IF(COUNTIF(tbl_OPAOINN_P2Coi28[Coinsurance],tbl_OPAOINN_P2Coi28[[#This Row],[Coinsurance]])>1,\"Remove Duplicate Entry.\",IF(AND(tbl_OPAOINN_P2Coi28[[#This Row],[Coinsurance]]<>\"\",tbl_OPAOINN_P2Coi28[[#This Row],[Allowed Claims]]=0),\"Entry not found in Part 1 Table\",IF(AND(OFFSET(tbl_OPAOINN_P2Coi28[[#This Row],[Coinsurance]],1,0)<>\"Total\",OFFSET(tbl_OPAOINN_P2Coi28[[#This Row],[Coinsurance]],1,0)<>\"\",OFFSET(tbl_OPAOINN_P2Coi28[[#This Row],[Coinsurance]],1,0)<tbl_OPAOINN_P2Coi28[[#This Row],[Coinsurance]]),\"Sort Entries from lowest to highest\",\"\")))","v":""},null,null,null,null,null,{"$f":"SUMIF(tbl_OPOON_P130[Coinsurance],BD104,tbl_OPOON_P130[Plan Projected Allowed Amount])","v":0},{"$f":"IF(OR(BE104=0,BE104=\"\"),\"\",BE104/tbl_OPOON_P2Coi33[[#Totals],[Allowed Claims]])","v":""},{"$f":"IF(BF104=\"\",\"\",IF(SUMIF(tbl_OPOON_P2Coi33[Coinsurance],\">=\"&BD104,tbl_OPOON_P2Coi33[Portion])>0.5,BD104,\"\"))","v":""},{"$f":"IF(COUNTIF(tbl_OPOON_P2Coi33[Coinsurance],tbl_OPOON_P2Coi33[[#This Row],[Coinsurance]])>1,\"Remove Duplicate Entry.\",IF(AND(tbl_OPOON_P2Coi33[[#This Row],[Coinsurance]]<>\"\",tbl_OPOON_P2Coi33[[#This Row],[Allowed Claims]]=0),\"Entry not found in Part 1 Table\",IF(AND(OFFSET(tbl_OPOON_P2Coi33[[#This Row],[Coinsurance]],1,0)<>\"Total\",OFFSET(tbl_OPOON_P2Coi33[[#This Row],[Coinsurance]],1,0)<>\"\",OFFSET(tbl_OPOON_P2Coi33[[#This Row],[Coinsurance]],1,0)<tbl_OPOON_P2Coi33[[#This Row],[Coinsurance]]),\"Sort Entries from lowest to highest\",\"\")))","v":""},null,null,null,null,null,{"$f":"SUMIF(tbl_OPOVOON_P135[Coinsurance],BM104,tbl_OPOVOON_P135[Plan Projected Allowed Amount])","v":0},{"$f":"IF(OR(BN104=0,BN104=\"\"),\"\",BN104/tbl_OPOVOON_P2Coi38[[#Totals],[Allowed Claims]])","v":""},{"$f":"IF(BO104=\"\",\"\",IF(SUMIF(tbl_OPOVOON_P2Coi38[Coinsurance],\">=\"&BM104,tbl_OPOVOON_P2Coi38[Portion])>0.5,BM104,\"\"))","v":""},{"$f":"IF(COUNTIF(tbl_OPOVOON_P2Coi38[Coinsurance],tbl_OPOVOON_P2Coi38[[#This Row],[Coinsurance]])>1,\"Remove Duplicate Entry.\",IF(AND(tbl_OPOVOON_P2Coi38[[#This Row],[Coinsurance]]<>\"\",tbl_OPOVOON_P2Coi38[[#This Row],[Allowed Claims]]=0),\"Entry not found in Part 1 Table\",IF(AND(OFFSET(tbl_OPOVOON_P2Coi38[[#This Row],[Coinsurance]],1,0)<>\"Total\",OFFSET(tbl_OPOVOON_P2Coi38[[#This Row],[Coinsurance]],1,0)<>\"\",OFFSET(tbl_OPOVOON_P2Coi38[[#This Row],[Coinsurance]],1,0)<tbl_OPOVOON_P2Coi38[[#This Row],[Coinsurance]]),\"Sort Entries from lowest to highest\",\"\")))","v":""},null,null,null,null,null,{"$f":"SUMIF(tbl_OPAOOON_P140[Coinsurance],BV104,tbl_OPAOOON_P140[Plan Projected Allowed Amount])","v":0},{"$f":"IF(OR(BW104=0,BW104=\"\"),\"\",BW104/tbl_OPAOOON_P2Coi43[[#Totals],[Allowed Claims]])","v":""},{"$f":"IF(BX104=\"\",\"\",IF(SUMIF(tbl_OPAOOON_P2Coi43[Coinsurance],\">=\"&BV104,tbl_OPAOOON_P2Coi43[Portion])>0.5,BV104,\"\"))","v":""},{"$f":"IF(COUNTIF(tbl_OPAOOON_P2Coi43[Coinsurance],tbl_OPAOOON_P2Coi43[[#This Row],[Coinsurance]])>1,\"Remove Duplicate Entry.\",IF(AND(tbl_OPAOOON_P2Coi43[[#This Row],[Coinsurance]]<>\"\",tbl_OPAOOON_P2Coi43[[#This Row],[Allowed Claims]]=0),\"Entry not found in Part 1 Table\",IF(AND(OFFSET(tbl_OPAOOON_P2Coi43[[#This Row],[Coinsurance]],1,0)<>\"Total\",OFFSET(tbl_OPAOOON_P2Coi43[[#This Row],[Coinsurance]],1,0)<>\"\",OFFSET(tbl_OPAOOON_P2Coi43[[#This Row],[Coinsurance]],1,0)<tbl_OPAOOON_P2Coi43[[#This Row],[Coinsurance]]),\"Sort Entries from lowest to highest\",\"\")))","v":""},null,null,null,null,null,{"$f":"SUMIF(tbl_ER_P145[Coinsurance],CE104,tbl_ER_P145[Plan Projected Allowed Amount])","v":0},{"$f":"IF(OR(CF104=0,CF104=\"\"),\"\",CF104/tbl_ER_P2Coi47[[#Totals],[Allowed Claims]])","v":""},{"$f":"IF(CG104=\"\",\"\",IF(SUMIF(tbl_ER_P2Coi47[Coinsurance],\">=\"&CE104,tbl_ER_P2Coi47[Portion])>0.5,CE104,\"\"))","v":""},{"$f":"IF(COUNTIF(tbl_ER_P2Coi47[Coinsurance],tbl_ER_P2Coi47[[#This Row],[Coinsurance]])>1,\"Remove Duplicate Entry.\",IF(AND(tbl_ER_P2Coi47[[#This Row],[Coinsurance]]<>\"\",tbl_ER_P2Coi47[[#This Row],[Allowed Claims]]=0),\"Entry not found in Part 1 Table\",IF(AND(OFFSET(tbl_ER_P2Coi47[[#This Row],[Coinsurance]],1,0)<>\"Total\",OFFSET(tbl_ER_P2Coi47[[#This Row],[Coinsurance]],1,0)<>\"\",OFFSET(tbl_ER_P2Coi47[[#This Row],[Coinsurance]],1,0)<tbl_ER_P2Coi47[[#This Row],[Coinsurance]]),\"Sort Entries from lowest to highest\",\"\")))","v":""},null,null,null,null,null,{"$f":"SUMIF(tbl_RX_P149[Coinsurance],CN104,tbl_RX_P149[Plan Projected Allowed Amount])","v":0},{"$f":"IF(OR(CO104=0,CO104=\"\"),\"\",CO104/tbl_RX_P2Coi52[[#Totals],[Allowed Claims]])","v":""},{"$f":"IF(CP104=\"\",\"\",IF(SUMIF(tbl_RX_P2Coi52[Coinsurance],\">=\"&CN104,tbl_RX_P2Coi52[Portion])>0.5,CN104,\"\"))","v":""},{"$f":"IF(COUNTIF(tbl_RX_P2Coi52[Coinsurance],tbl_RX_P2Coi52[[#This Row],[Coinsurance]])>1,\"Remove Duplicate Entry.\",IF(AND(tbl_RX_P2Coi52[[#This Row],[Coinsurance]]<>\"\",tbl_RX_P2Coi52[[#This Row],[Allowed Claims]]=0),\"Entry not found in Part 1 Table\",IF(AND(OFFSET(tbl_RX_P2Coi52[[#This Row],[Coinsurance]],1,0)<>\"Total\",OFFSET(tbl_RX_P2Coi52[[#This Row],[Coinsurance]],1,0)<>\"\",OFFSET(tbl_RX_P2Coi52[[#This Row],[Coinsurance]],1,0)<tbl_RX_P2Coi52[[#This Row],[Coinsurance]]),\"Sort Entries from lowest to highest\",\"\")))","v":""}]
[null,null,null,null,null,null,null,null,null,null,0.25,{"$f":"SUMIF(tbl_IPINN_P15[Coinsurance],K105,tbl_IPINN_P15[Plan Projected Allowed Amount])","v":0},{"$f":"IF(OR(L105=0,L105=\"\"),\"\",L105/tbl_IPINN_P2Coi8[[#Totals],[Allowed Claims]])","v":""},{"$f":"IF(M105=\"\",\"\",IF(SUMIF(tbl_IPINN_P2Coi8[Coinsurance],\">=\"&K105,tbl_IPINN_P2Coi8[Portion])>0.5,K105,\"\"))","v":""},{"$f":"IF(COUNTIF(tbl_IPINN_P2Coi8[Coinsurance],tbl_IPINN_P2Coi8[[#This Row],[Coinsurance]])>1,\"Remove Duplicate Entry.\",IF(AND(tbl_IPINN_P2Coi8[[#This Row],[Coinsurance]]<>\"\",tbl_IPINN_P2Coi8[[#This Row],[Allowed Claims]]=0),\"Entry not found in Part 1 Table\",IF(AND(OFFSET(tbl_IPINN_P2Coi8[[#This Row],[Coinsurance]],1,0)<>\"Total\",OFFSET(tbl_IPINN_P2Coi8[[#This Row],[Coinsurance]],1,0)<>\"\",OFFSET(tbl_IPINN_P2Coi8[[#This Row],[Coinsurance]],1,0)<tbl_IPINN_P2Coi8[[#This Row],[Coinsurance]]),\"Sort Entries from lowest to highest\",\"\")))","v":"Entry not found in Part 1 Table"},null,null,null,null,null,{"$f":"SUMIF(tbl_IPOON_P110[Coinsurance],T105,tbl_IPOON_P110[Plan Projected Allowed Amount])","v":0},{"$f":"IF(OR(U105=0,U105=\"\"),\"\",U105/tbl_IPOON_P2Coi13[[#Totals],[Allowed Claims]])","v":""},{"$f":"IF(V105=\"\",\"\",IF(SUMIF(tbl_IPOON_P2Coi13[Coinsurance],\">=\"&T105,tbl_IPOON_P2Coi13[Portion])>0.5,T105,\"\"))","v":""},{"$f":"IF(COUNTIF(tbl_IPOON_P2Coi13[Coinsurance],tbl_IPOON_P2Coi13[[#This Row],[Coinsurance]])>1,\"Remove Duplicate Entry.\",IF(AND(tbl_IPOON_P2Coi13[[#This Row],[Coinsurance]]<>\"\",tbl_IPOON_P2Coi13[[#This Row],[Allowed Claims]]=0),\"Entry not found in Part 1 Table\",IF(AND(OFFSET(tbl_IPOON_P2Coi13[[#This Row],[Coinsurance]],1,0)<>\"Total\",OFFSET(tbl_IPOON_P2Coi13[[#This Row],[Coinsurance]],1,0)<>\"\",OFFSET(tbl_IPOON_P2Coi13[[#This Row],[Coinsurance]],1,0)<tbl_IPOON_P2Coi13[[#This Row],[Coinsurance]]),\"Sort Entries from lowest to highest\",\"\")))","v":""},null,null,null,null,null,{"$f":"SUMIF(tbl_OPINN_P115[Coinsurance],AC105,tbl_OPINN_P115[Plan Projected Allowed Amount])","v":0},{"$f":"IF(OR(AD105=0,AD105=\"\"),\"\",AD105/tbl_OPINN_P2Coi18[[#Totals],[Allowed Claims]])","v":""},{"$f":"IF(AE105=\"\",\"\",IF(SUMIF(tbl_OPINN_P2Coi18[Coinsurance],\">=\"&AC105,tbl_OPINN_P2Coi18[Portion])>0.5,AC105,\"\"))","v":""},{"$f":"IF(COUNTIF(tbl_OPINN_P2Coi18[Coinsurance],tbl_OPINN_P2Coi18[[#This Row],[Coinsurance]])>1,\"Remove Duplicate Entry.\",IF(AND(tbl_OPINN_P2Coi18[[#This Row],[Coinsurance]]<>\"\",tbl_OPINN_P2Coi18[[#This Row],[Allowed Claims]]=0),\"Entry not found in Part 1 Table\",IF(AND(OFFSET(tbl_OPINN_P2Coi18[[#This Row],[Coinsurance]],1,0)<>\"Total\",OFFSET(tbl_OPINN_P2Coi18[[#This Row],[Coinsurance]],1,0)<>\"\",OFFSET(tbl_OPINN_P2Coi18[[#This Row],[Coinsurance]],1,0)<tbl_OPINN_P2Coi18[[#This Row],[Coinsurance]]),\"Sort Entries from lowest to highest\",\"\")))","v":""},null,null,null,null,null,{"$f":"SUMIF(tbl_OPOVINN_P120[Coinsurance],AL105,tbl_OPOVINN_P120[Plan Projected Allowed Amount])","v":0},{"$f":"IF(OR(AM105=0,AM105=\"\"),\"\",AM105/tbl_OPOVINN_P2Coi23[[#Totals],[Allowed Claims]])","v":""},{"$f":"IF(AN105=\"\",\"\",IF(SUMIF(tbl_OPOVINN_P2Coi23[Coinsurance],\">=\"&AL105,tbl_OPOVINN_P2Coi23[Portion])>0.5,AL105,\"\"))","v":""},{"$f":"IF(COUNTIF(tbl_OPOVINN_P2Coi23[Coinsurance],tbl_OPOVINN_P2Coi23[[#This Row],[Coinsurance]])>1,\"Remove Duplicate Entry.\",IF(AND(tbl_OPOVINN_P2Coi23[[#This Row],[Coinsurance]]<>\"\",tbl_OPOVINN_P2Coi23[[#This Row],[Allowed Claims]]=0),\"Entry not found in Part 1 Table\",IF(AND(OFFSET(tbl_OPOVINN_P2Coi23[[#This Row],[Coinsurance]],1,0)<>\"Total\",OFFSET(tbl_OPOVINN_P2Coi23[[#This Row],[Coinsurance]],1,0)<>\"\",OFFSET(tbl_OPOVINN_P2Coi23[[#This Row],[Coinsurance]],1,0)<tbl_OPOVINN_P2Coi23[[#This Row],[Coinsurance]]),\"Sort Entries from lowest to highest\",\"\")))","v":""},null,null,null,null,null,{"$f":"SUMIF(tbl_OPAOINN_P125[Coinsurance],AU105,tbl_OPAOINN_P125[Plan Projected Allowed Amount])","v":0},{"$f":"IF(OR(AV105=0,AV105=\"\"),\"\",AV105/tbl_OPAOINN_P2Coi28[[#Totals],[Allowed Claims]])","v":""},{"$f":"IF(AW105=\"\",\"\",IF(SUMIF(tbl_OPAOINN_P2Coi28[Coinsurance],\">=\"&AU105,tbl_OPAOINN_P2Coi28[Portion])>0.5,AU105,\"\"))","v":""},{"$f":"IF(COUNTIF(tbl_OPAOINN_P2Coi28[Coinsurance],tbl_OPAOINN_P2Coi28[[#This Row],[Coinsurance]])>1,\"Remove Duplicate Entry.\",IF(AND(tbl_OPAOINN_P2Coi28[[#This Row],[Coinsurance]]<>\"\",tbl_OPAOINN_P2Coi28[[#This Row],[Allowed Claims]]=0),\"Entry not found in Part 1 Table\",IF(AND(OFFSET(tbl_OPAOINN_P2Coi28[[#This Row],[Coinsurance]],1,0)<>\"Total\",OFFSET(tbl_OPAOINN_P2Coi28[[#This Row],[Coinsurance]],1,0)<>\"\",OFFSET(tbl_OPAOINN_P2Coi28[[#This Row],[Coinsurance]],1,0)<tbl_OPAOINN_P2Coi28[[#This Row],[Coinsurance]]),\"Sort Entries from lowest to highest\",\"\")))","v":""},null,null,null,null,null,{"$f":"SUMIF(tbl_OPOON_P130[Coinsurance],BD105,tbl_OPOON_P130[Plan Projected Allowed Amount])","v":0},{"$f":"IF(OR(BE105=0,BE105=\"\"),\"\",BE105/tbl_OPOON_P2Coi33[[#Totals],[Allowed Claims]])","v":""},{"$f":"IF(BF105=\"\",\"\",IF(SUMIF(tbl_OPOON_P2Coi33[Coinsurance],\">=\"&BD105,tbl_OPOON_P2Coi33[Portion])>0.5,BD105,\"\"))","v":""},{"$f":"IF(COUNTIF(tbl_OPOON_P2Coi33[Coinsurance],tbl_OPOON_P2Coi33[[#This Row],[Coinsurance]])>1,\"Remove Duplicate Entry.\",IF(AND(tbl_OPOON_P2Coi33[[#This Row],[Coinsurance]]<>\"\",tbl_OPOON_P2Coi33[[#This Row],[Allowed Claims]]=0),\"Entry not found in Part 1 Table\",IF(AND(OFFSET(tbl_OPOON_P2Coi33[[#This Row],[Coinsurance]],1,0)<>\"Total\",OFFSET(tbl_OPOON_P2Coi33[[#This Row],[Coinsurance]],1,0)<>\"\",OFFSET(tbl_OPOON_P2Coi33[[#This Row],[Coinsurance]],1,0)<tbl_OPOON_P2Coi33[[#This Row],[Coinsurance]]),\"Sort Entries from lowest to highest\",\"\")))","v":""},null,null,null,null,null,{"$f":"SUMIF(tbl_OPOVOON_P135[Coinsurance],BM105,tbl_OPOVOON_P135[Plan Projected Allowed Amount])","v":0},{"$f":"IF(OR(BN105=0,BN105=\"\"),\"\",BN105/tbl_OPOVOON_P2Coi38[[#Totals],[Allowed Claims]])","v":""},{"$f":"IF(BO105=\"\",\"\",IF(SUMIF(tbl_OPOVOON_P2Coi38[Coinsurance],\">=\"&BM105,tbl_OPOVOON_P2Coi38[Portion])>0.5,BM105,\"\"))","v":""},{"$f":"IF(COUNTIF(tbl_OPOVOON_P2Coi38[Coinsurance],tbl_OPOVOON_P2Coi38[[#This Row],[Coinsurance]])>1,\"Remove Duplicate Entry.\",IF(AND(tbl_OPOVOON_P2Coi38[[#This Row],[Coinsurance]]<>\"\",tbl_OPOVOON_P2Coi38[[#This Row],[Allowed Claims]]=0),\"Entry not found in Part 1 Table\",IF(AND(OFFSET(tbl_OPOVOON_P2Coi38[[#This Row],[Coinsurance]],1,0)<>\"Total\",OFFSET(tbl_OPOVOON_P2Coi38[[#This Row],[Coinsurance]],1,0)<>\"\",OFFSET(tbl_OPOVOON_P2Coi38[[#This Row],[Coinsurance]],1,0)<tbl_OPOVOON_P2Coi38[[#This Row],[Coinsurance]]),\"Sort Entries from lowest to highest\",\"\")))","v":""},null,null,null,null,null,{"$f":"SUMIF(tbl_OPAOOON_P140[Coinsurance],BV105,tbl_OPAOOON_P140[Plan Projected Allowed Amount])","v":0},{"$f":"IF(OR(BW105=0,BW105=\"\"),\"\",BW105/tbl_OPAOOON_P2Coi43[[#Totals],[Allowed Claims]])","v":""},{"$f":"IF(BX105=\"\",\"\",IF(SUMIF(tbl_OPAOOON_P2Coi43[Coinsurance],\">=\"&BV105,tbl_OPAOOON_P2Coi43[Portion])>0.5,BV105,\"\"))","v":""},{"$f":"IF(COUNTIF(tbl_OPAOOON_P2Coi43[Coinsurance],tbl_OPAOOON_P2Coi43[[#This Row],[Coinsurance]])>1,\"Remove Duplicate Entry.\",IF(AND(tbl_OPAOOON_P2Coi43[[#This Row],[Coinsurance]]<>\"\",tbl_OPAOOON_P2Coi43[[#This Row],[Allowed Claims]]=0),\"Entry not found in Part 1 Table\",IF(AND(OFFSET(tbl_OPAOOON_P2Coi43[[#This Row],[Coinsurance]],1,0)<>\"Total\",OFFSET(tbl_OPAOOON_P2Coi43[[#This Row],[Coinsurance]],1,0)<>\"\",OFFSET(tbl_OPAOOON_P2Coi43[[#This Row],[Coinsurance]],1,0)<tbl_OPAOOON_P2Coi43[[#This Row],[Coinsurance]]),\"Sort Entries from lowest to highest\",\"\")))","v":""},null,null,null,null,null,{"$f":"SUMIF(tbl_ER_P145[Coinsurance],CE105,tbl_ER_P145[Plan Projected Allowed Amount])","v":0},{"$f":"IF(OR(CF105=0,CF105=\"\"),\"\",CF105/tbl_ER_P2Coi47[[#Totals],[Allowed Claims]])","v":""},{"$f":"IF(CG105=\"\",\"\",IF(SUMIF(tbl_ER_P2Coi47[Coinsurance],\">=\"&CE105,tbl_ER_P2Coi47[Portion])>0.5,CE105,\"\"))","v":""},{"$f":"IF(COUNTIF(tbl_ER_P2Coi47[Coinsurance],tbl_ER_P2Coi47[[#This Row],[Coinsurance]])>1,\"Remove Duplicate Entry.\",IF(AND(tbl_ER_P2Coi47[[#This Row],[Coinsurance]]<>\"\",tbl_ER_P2Coi47[[#This Row],[Allowed Claims]]=0),\"Entry not found in Part 1 Table\",IF(AND(OFFSET(tbl_ER_P2Coi47[[#This Row],[Coinsurance]],1,0)<>\"Total\",OFFSET(tbl_ER_P2Coi47[[#This Row],[Coinsurance]],1,0)<>\"\",OFFSET(tbl_ER_P2Coi47[[#This Row],[Coinsurance]],1,0)<tbl_ER_P2Coi47[[#This Row],[Coinsurance]]),\"Sort Entries from lowest to highest\",\"\")))","v":""},null,null,null,null,null,{"$f":"SUMIF(tbl_RX_P149[Coinsurance],CN105,tbl_RX_P149[Plan Projected Allowed Amount])","v":0},{"$f":"IF(OR(CO105=0,CO105=\"\"),\"\",CO105/tbl_RX_P2Coi52[[#Totals],[Allowed Claims]])","v":""},{"$f":"IF(CP105=\"\",\"\",IF(SUMIF(tbl_RX_P2Coi52[Coinsurance],\">=\"&CN105,tbl_RX_P2Coi52[Portion])>0.5,CN105,\"\"))","v":""},{"$f":"IF(COUNTIF(tbl_RX_P2Coi52[Coinsurance],tbl_RX_P2Coi52[[#This Row],[Coinsurance]])>1,\"Remove Duplicate Entry.\",IF(AND(tbl_RX_P2Coi52[[#This Row],[Coinsurance]]<>\"\",tbl_RX_P2Coi52[[#This Row],[Allowed Claims]]=0),\"Entry not found in Part 1 Table\",IF(AND(OFFSET(tbl_RX_P2Coi52[[#This Row],[Coinsurance]],1,0)<>\"Total\",OFFSET(tbl_RX_P2Coi52[[#This Row],[Coinsurance]],1,0)<>\"\",OFFSET(tbl_RX_P2Coi52[[#This Row],[Coinsurance]],1,0)<tbl_RX_P2Coi52[[#This Row],[Coinsurance]]),\"Sort Entries from lowest to highest\",\"\")))","v":""}]
[null,null,null,null,null,null,null,null,null,null,null,{"$f":"SUMIF(tbl_IPINN_P15[Coinsurance],K106,tbl_IPINN_P15[Plan Projected Allowed Amount])","v":0},{"$f":"IF(OR(L106=0,L106=\"\"),\"\",L106/tbl_IPINN_P2Coi8[[#Totals],[Allowed Claims]])","v":""},{"$f":"IF(M106=\"\",\"\",IF(SUMIF(tbl_IPINN_P2Coi8[Coinsurance],\">=\"&K106,tbl_IPINN_P2Coi8[Portion])>0.5,K106,\"\"))","v":""},{"$f":"IF(COUNTIF(tbl_IPINN_P2Coi8[Coinsurance],tbl_IPINN_P2Coi8[[#This Row],[Coinsurance]])>1,\"Remove Duplicate Entry.\",IF(AND(tbl_IPINN_P2Coi8[[#This Row],[Coinsurance]]<>\"\",tbl_IPINN_P2Coi8[[#This Row],[Allowed Claims]]=0),\"Entry not found in Part 1 Table\",IF(AND(OFFSET(tbl_IPINN_P2Coi8[[#This Row],[Coinsurance]],1,0)<>\"Total\",OFFSET(tbl_IPINN_P2Coi8[[#This Row],[Coinsurance]],1,0)<>\"\",OFFSET(tbl_IPINN_P2Coi8[[#This Row],[Coinsurance]],1,0)<tbl_IPINN_P2Coi8[[#This Row],[Coinsurance]]),\"Sort Entries from lowest to highest\",\"\")))","v":""},null,null,null,null,null,{"$f":"SUMIF(tbl_IPOON_P110[Coinsurance],T106,tbl_IPOON_P110[Plan Projected Allowed Amount])","v":0},{"$f":"IF(OR(U106=0,U106=\"\"),\"\",U106/tbl_IPOON_P2Coi13[[#Totals],[Allowed Claims]])","v":""},{"$f":"IF(V106=\"\",\"\",IF(SUMIF(tbl_IPOON_P2Coi13[Coinsurance],\">=\"&T106,tbl_IPOON_P2Coi13[Portion])>0.5,T106,\"\"))","v":""},{"$f":"IF(COUNTIF(tbl_IPOON_P2Coi13[Coinsurance],tbl_IPOON_P2Coi13[[#This Row],[Coinsurance]])>1,\"Remove Duplicate Entry.\",IF(AND(tbl_IPOON_P2Coi13[[#This Row],[Coinsurance]]<>\"\",tbl_IPOON_P2Coi13[[#This Row],[Allowed Claims]]=0),\"Entry not found in Part 1 Table\",IF(AND(OFFSET(tbl_IPOON_P2Coi13[[#This Row],[Coinsurance]],1,0)<>\"Total\",OFFSET(tbl_IPOON_P2Coi13[[#This Row],[Coinsurance]],1,0)<>\"\",OFFSET(tbl_IPOON_P2Coi13[[#This Row],[Coinsurance]],1,0)<tbl_IPOON_P2Coi13[[#This Row],[Coinsurance]]),\"Sort Entries from lowest to highest\",\"\")))","v":""},null,null,null,null,null,{"$f":"SUMIF(tbl_OPINN_P115[Coinsurance],AC106,tbl_OPINN_P115[Plan Projected Allowed Amount])","v":0},{"$f":"IF(OR(AD106=0,AD106=\"\"),\"\",AD106/tbl_OPINN_P2Coi18[[#Totals],[Allowed Claims]])","v":""},{"$f":"IF(AE106=\"\",\"\",IF(SUMIF(tbl_OPINN_P2Coi18[Coinsurance],\">=\"&AC106,tbl_OPINN_P2Coi18[Portion])>0.5,AC106,\"\"))","v":""},{"$f":"IF(COUNTIF(tbl_OPINN_P2Coi18[Coinsurance],tbl_OPINN_P2Coi18[[#This Row],[Coinsurance]])>1,\"Remove Duplicate Entry.\",IF(AND(tbl_OPINN_P2Coi18[[#This Row],[Coinsurance]]<>\"\",tbl_OPINN_P2Coi18[[#This Row],[Allowed Claims]]=0),\"Entry not found in Part 1 Table\",IF(AND(OFFSET(tbl_OPINN_P2Coi18[[#This Row],[Coinsurance]],1,0)<>\"Total\",OFFSET(tbl_OPINN_P2Coi18[[#This Row],[Coinsurance]],1,0)<>\"\",OFFSET(tbl_OPINN_P2Coi18[[#This Row],[Coinsurance]],1,0)<tbl_OPINN_P2Coi18[[#This Row],[Coinsurance]]),\"Sort Entries from lowest to highest\",\"\")))","v":""},null,null,null,null,null,{"$f":"SUMIF(tbl_OPOVINN_P120[Coinsurance],AL106,tbl_OPOVINN_P120[Plan Projected Allowed Amount])","v":0},{"$f":"IF(OR(AM106=0,AM106=\"\"),\"\",AM106/tbl_OPOVINN_P2Coi23[[#Totals],[Allowed Claims]])","v":""},{"$f":"IF(AN106=\"\",\"\",IF(SUMIF(tbl_OPOVINN_P2Coi23[Coinsurance],\">=\"&AL106,tbl_OPOVINN_P2Coi23[Portion])>0.5,AL106,\"\"))","v":""},{"$f":"IF(COUNTIF(tbl_OPOVINN_P2Coi23[Coinsurance],tbl_OPOVINN_P2Coi23[[#This Row],[Coinsurance]])>1,\"Remove Duplicate Entry.\",IF(AND(tbl_OPOVINN_P2Coi23[[#This Row],[Coinsurance]]<>\"\",tbl_OPOVINN_P2Coi23[[#This Row],[Allowed Claims]]=0),\"Entry not found in Part 1 Table\",IF(AND(OFFSET(tbl_OPOVINN_P2Coi23[[#This Row],[Coinsurance]],1,0)<>\"Total\",OFFSET(tbl_OPOVINN_P2Coi23[[#This Row],[Coinsurance]],1,0)<>\"\",OFFSET(tbl_OPOVINN_P2Coi23[[#This Row],[Coinsurance]],1,0)<tbl_OPOVINN_P2Coi23[[#This Row],[Coinsurance]]),\"Sort Entries from lowest to highest\",\"\")))","v":""},null,null,null,null,null,{"$f":"SUMIF(tbl_OPAOINN_P125[Coinsurance],AU106,tbl_OPAOINN_P125[Plan Projected Allowed Amount])","v":0},{"$f":"IF(OR(AV106=0,AV106=\"\"),\"\",AV106/tbl_OPAOINN_P2Coi28[[#Totals],[Allowed Claims]])","v":""},{"$f":"IF(AW106=\"\",\"\",IF(SUMIF(tbl_OPAOINN_P2Coi28[Coinsurance],\">=\"&AU106,tbl_OPAOINN_P2Coi28[Portion])>0.5,AU106,\"\"))","v":""},{"$f":"IF(COUNTIF(tbl_OPAOINN_P2Coi28[Coinsurance],tbl_OPAOINN_P2Coi28[[#This Row],[Coinsurance]])>1,\"Remove Duplicate Entry.\",IF(AND(tbl_OPAOINN_P2Coi28[[#This Row],[Coinsurance]]<>\"\",tbl_OPAOINN_P2Coi28[[#This Row],[Allowed Claims]]=0),\"Entry not found in Part 1 Table\",IF(AND(OFFSET(tbl_OPAOINN_P2Coi28[[#This Row],[Coinsurance]],1,0)<>\"Total\",OFFSET(tbl_OPAOINN_P2Coi28[[#This Row],[Coinsurance]],1,0)<>\"\",OFFSET(tbl_OPAOINN_P2Coi28[[#This Row],[Coinsurance]],1,0)<tbl_OPAOINN_P2Coi28[[#This Row],[Coinsurance]]),\"Sort Entries from lowest to highest\",\"\")))","v":""},null,null,null,null,null,{"$f":"SUMIF(tbl_OPOON_P130[Coinsurance],BD106,tbl_OPOON_P130[Plan Projected Allowed Amount])","v":0},{"$f":"IF(OR(BE106=0,BE106=\"\"),\"\",BE106/tbl_OPOON_P2Coi33[[#Totals],[Allowed Claims]])","v":""},{"$f":"IF(BF106=\"\",\"\",IF(SUMIF(tbl_OPOON_P2Coi33[Coinsurance],\">=\"&BD106,tbl_OPOON_P2Coi33[Portion])>0.5,BD106,\"\"))","v":""},{"$f":"IF(COUNTIF(tbl_OPOON_P2Coi33[Coinsurance],tbl_OPOON_P2Coi33[[#This Row],[Coinsurance]])>1,\"Remove Duplicate Entry.\",IF(AND(tbl_OPOON_P2Coi33[[#This Row],[Coinsurance]]<>\"\",tbl_OPOON_P2Coi33[[#This Row],[Allowed Claims]]=0),\"Entry not found in Part 1 Table\",IF(AND(OFFSET(tbl_OPOON_P2Coi33[[#This Row],[Coinsurance]],1,0)<>\"Total\",OFFSET(tbl_OPOON_P2Coi33[[#This Row],[Coinsurance]],1,0)<>\"\",OFFSET(tbl_OPOON_P2Coi33[[#This Row],[Coinsurance]],1,0)<tbl_OPOON_P2Coi33[[#This Row],[Coinsurance]]),\"Sort Entries from lowest to highest\",\"\")))","v":""},null,null,null,null,null,{"$f":"SUMIF(tbl_OPOVOON_P135[Coinsurance],BM106,tbl_OPOVOON_P135[Plan Projected Allowed Amount])","v":0},{"$f":"IF(OR(BN106=0,BN106=\"\"),\"\",BN106/tbl_OPOVOON_P2Coi38[[#Totals],[Allowed Claims]])","v":""},{"$f":"IF(BO106=\"\",\"\",IF(SUMIF(tbl_OPOVOON_P2Coi38[Coinsurance],\">=\"&BM106,tbl_OPOVOON_P2Coi38[Portion])>0.5,BM106,\"\"))","v":""},{"$f":"IF(COUNTIF(tbl_OPOVOON_P2Coi38[Coinsurance],tbl_OPOVOON_P2Coi38[[#This Row],[Coinsurance]])>1,\"Remove Duplicate Entry.\",IF(AND(tbl_OPOVOON_P2Coi38[[#This Row],[Coinsurance]]<>\"\",tbl_OPOVOON_P2Coi38[[#This Row],[Allowed Claims]]=0),\"Entry not found in Part 1 Table\",IF(AND(OFFSET(tbl_OPOVOON_P2Coi38[[#This Row],[Coinsurance]],1,0)<>\"Total\",OFFSET(tbl_OPOVOON_P2Coi38[[#This Row],[Coinsurance]],1,0)<>\"\",OFFSET(tbl_OPOVOON_P2Coi38[[#This Row],[Coinsurance]],1,0)<tbl_OPOVOON_P2Coi38[[#This Row],[Coinsurance]]),\"Sort Entries from lowest to highest\",\"\")))","v":""},null,null,null,null,null,{"$f":"SUMIF(tbl_OPAOOON_P140[Coinsurance],BV106,tbl_OPAOOON_P140[Plan Projected Allowed Amount])","v":0},{"$f":"IF(OR(BW106=0,BW106=\"\"),\"\",BW106/tbl_OPAOOON_P2Coi43[[#Totals],[Allowed Claims]])","v":""},{"$f":"IF(BX106=\"\",\"\",IF(SUMIF(tbl_OPAOOON_P2Coi43[Coinsurance],\">=\"&BV106,tbl_OPAOOON_P2Coi43[Portion])>0.5,BV106,\"\"))","v":""},{"$f":"IF(COUNTIF(tbl_OPAOOON_P2Coi43[Coinsurance],tbl_OPAOOON_P2Coi43[[#This Row],[Coinsurance]])>1,\"Remove Duplicate Entry.\",IF(AND(tbl_OPAOOON_P2Coi43[[#This Row],[Coinsurance]]<>\"\",tbl_OPAOOON_P2Coi43[[#This Row],[Allowed Claims]]=0),\"Entry not found in Part 1 Table\",IF(AND(OFFSET(tbl_OPAOOON_P2Coi43[[#This Row],[Coinsurance]],1,0)<>\"Total\",OFFSET(tbl_OPAOOON_P2Coi43[[#This Row],[Coinsurance]],1,0)<>\"\",OFFSET(tbl_OPAOOON_P2Coi43[[#This Row],[Coinsurance]],1,0)<tbl_OPAOOON_P2Coi43[[#This Row],[Coinsurance]]),\"Sort Entries from lowest to highest\",\"\")))","v":""},null,null,null,null,null,{"$f":"SUMIF(tbl_ER_P145[Coinsurance],CE106,tbl_ER_P145[Plan Projected Allowed Amount])","v":0},{"$f":"IF(OR(CF106=0,CF106=\"\"),\"\",CF106/tbl_ER_P2Coi47[[#Totals],[Allowed Claims]])","v":""},{"$f":"IF(CG106=\"\",\"\",IF(SUMIF(tbl_ER_P2Coi47[Coinsurance],\">=\"&CE106,tbl_ER_P2Coi47[Portion])>0.5,CE106,\"\"))","v":""},{"$f":"IF(COUNTIF(tbl_ER_P2Coi47[Coinsurance],tbl_ER_P2Coi47[[#This Row],[Coinsurance]])>1,\"Remove Duplicate Entry.\",IF(AND(tbl_ER_P2Coi47[[#This Row],[Coinsurance]]<>\"\",tbl_ER_P2Coi47[[#This Row],[Allowed Claims]]=0),\"Entry not found in Part 1 Table\",IF(AND(OFFSET(tbl_ER_P2Coi47[[#This Row],[Coinsurance]],1,0)<>\"Total\",OFFSET(tbl_ER_P2Coi47[[#This Row],[Coinsurance]],1,0)<>\"\",OFFSET(tbl_ER_P2Coi47[[#This Row],[Coinsurance]],1,0)<tbl_ER_P2Coi47[[#This Row],[Coinsurance]]),\"Sort Entries from lowest to highest\",\"\")))","v":""},null,null,null,null,null,{"$f":"SUMIF(tbl_RX_P149[Coinsurance],CN106,tbl_RX_P149[Plan Projected Allowed Amount])","v":0},{"$f":"IF(OR(CO106=0,CO106=\"\"),\"\",CO106/tbl_RX_P2Coi52[[#Totals],[Allowed Claims]])","v":""},{"$f":"IF(CP106=\"\",\"\",IF(SUMIF(tbl_RX_P2Coi52[Coinsurance],\">=\"&CN106,tbl_RX_P2Coi52[Portion])>0.5,CN106,\"\"))","v":""},{"$f":"IF(COUNTIF(tbl_RX_P2Coi52[Coinsurance],tbl_RX_P2Coi52[[#This Row],[Coinsurance]])>1,\"Remove Duplicate Entry.\",IF(AND(tbl_RX_P2Coi52[[#This Row],[Coinsurance]]<>\"\",tbl_RX_P2Coi52[[#This Row],[Allowed Claims]]=0),\"Entry not found in Part 1 Table\",IF(AND(OFFSET(tbl_RX_P2Coi52[[#This Row],[Coinsurance]],1,0)<>\"Total\",OFFSET(tbl_RX_P2Coi52[[#This Row],[Coinsurance]],1,0)<>\"\",OFFSET(tbl_RX_P2Coi52[[#This Row],[Coinsurance]],1,0)<tbl_RX_P2Coi52[[#This Row],[Coinsurance]]),\"Sort Entries from lowest to highest\",\"\")))","v":""}]
[null,null,null,null,null,null,null,null,null,null,null,{"$f":"SUMIF(tbl_IPINN_P15[Coinsurance],K107,tbl_IPINN_P15[Plan Projected Allowed Amount])","v":0},{"$f":"IF(OR(L107=0,L107=\"\"),\"\",L107/tbl_IPINN_P2Coi8[[#Totals],[Allowed Claims]])","v":""},{"$f":"IF(M107=\"\",\"\",IF(SUMIF(tbl_IPINN_P2Coi8[Coinsurance],\">=\"&K107,tbl_IPINN_P2Coi8[Portion])>0.5,K107,\"\"))","v":""},{"$f":"IF(COUNTIF(tbl_IPINN_P2Coi8[Coinsurance],tbl_IPINN_P2Coi8[[#This Row],[Coinsurance]])>1,\"Remove Duplicate Entry.\",IF(AND(tbl_IPINN_P2Coi8[[#This Row],[Coinsurance]]<>\"\",tbl_IPINN_P2Coi8[[#This Row],[Allowed Claims]]=0),\"Entry not found in Part 1 Table\",IF(AND(OFFSET(tbl_IPINN_P2Coi8[[#This Row],[Coinsurance]],1,0)<>\"Total\",OFFSET(tbl_IPINN_P2Coi8[[#This Row],[Coinsurance]],1,0)<>\"\",OFFSET(tbl_IPINN_P2Coi8[[#This Row],[Coinsurance]],1,0)<tbl_IPINN_P2Coi8[[#This Row],[Coinsurance]]),\"Sort Entries from lowest to highest\",\"\")))","v":""},null,null,null,null,"Total",{"$f":"SUBTOTAL(109,tbl_IPOON_P2Coi13[Allowed Claims])","v":0},{"$f":"SUBTOTAL(109,tbl_IPOON_P2Coi13[Portion])","v":0},null,{"$f":"IF(AND(tbl_IPOON_P2Coi13[[#Totals],[Allowed Claims]]<U73,W73<>\"Fail\",W73<>\"N/A\"),\"Add missing cost share values.\",IF(U107>V57,\"Allowed claims higher than possible; correct entries.\",\"\"))","v":""},null,null,null,null,"Total",{"$f":"SUBTOTAL(109,tbl_OPINN_P2Coi18[Allowed Claims])","v":0},{"$f":"SUBTOTAL(109,tbl_OPINN_P2Coi18[Portion])","v":0},null,{"$f":"IF(AND(tbl_OPINN_P2Coi18[[#Totals],[Allowed Claims]]<AD73,AF73<>\"Fail\",AF73<>\"N/A\"),\"Add missing cost share values.\",IF(AD107>AE55,\"Allowed claims higher than possible; correct entries.\",\"\"))","v":""},null,null,null,null,"Total",{"$f":"SUBTOTAL(109,tbl_OPOVINN_P2Coi23[Allowed Claims])","v":0},{"$f":"SUBTOTAL(109,tbl_OPOVINN_P2Coi23[Portion])","v":0},null,{"$f":"IF(AND(tbl_OPOVINN_P2Coi23[[#Totals],[Allowed Claims]]<AM73,AO73<>\"Fail\",AO73<>\"N/A\"),\"Add missing cost share values.\",IF(AM107>AN55,\"Allowed claims higher than possible; correct entries.\",\"\"))","v":""},null,null,null,null,"Total",{"$f":"SUBTOTAL(109,tbl_OPAOINN_P2Coi28[Allowed Claims])","v":0},{"$f":"SUBTOTAL(109,tbl_OPAOINN_P2Coi28[Portion])","v":0},null,{"$f":"IF(AND(tbl_OPAOINN_P2Coi28[[#Totals],[Allowed Claims]]<AV73,AX73<>\"Fail\",AX73<>\"N/A\"),\"Add missing cost share values.\",IF(AV107>AW55,\"Allowed claims higher than possible; correct entries.\",\"\"))","v":""},null,null,null,null,"Total",{"$f":"SUBTOTAL(109,tbl_OPOON_P2Coi33[Allowed Claims])","v":0},{"$f":"SUBTOTAL(109,tbl_OPOON_P2Coi33[Portion])","v":0},null,{"$f":"IF(AND(tbl_OPOON_P2Coi33[[#Totals],[Allowed Claims]]<BE73,BG73<>\"Fail\",BG73<>\"N/A\"),\"Add missing cost share values.\",IF(BE107>BF55,\"Allowed claims higher than possible; correct entries.\",\"\"))","v":""},null,null,null,null,"Total",{"$f":"SUBTOTAL(109,tbl_OPOVOON_P2Coi38[Allowed Claims])","v":0},{"$f":"SUBTOTAL(109,tbl_OPOVOON_P2Coi38[Portion])","v":0},null,{"$f":"IF(AND(tbl_OPOVOON_P2Coi38[[#Totals],[Allowed Claims]]<BN73,BP73<>\"Fail\",BP73<>\"N/A\"),\"Add missing cost share values.\",IF(BN107>BO55,\"Allowed claims higher than possible; correct entries.\",\"\"))","v":""},null,null,null,null,"Total",{"$f":"SUBTOTAL(109,tbl_OPAOOON_P2Coi43[Allowed Claims])","v":0},{"$f":"SUBTOTAL(109,tbl_OPAOOON_P2Coi43[Portion])","v":0},null,{"$f":"IF(AND(tbl_OPAOOON_P2Coi43[[#Totals],[Allowed Claims]]<BW73,BY73<>\"Fail\",BY73<>\"N/A\"),\"Add missing cost share values.\",IF(BW107>BX55,\"Allowed claims higher than possible; correct entries.\",\"\"))","v":""},null,null,null,null,"Total",{"$f":"SUBTOTAL(109,tbl_ER_P2Coi47[Allowed Claims])","v":0},{"$f":"SUBTOTAL(109,tbl_ER_P2Coi47[Portion])","v":0},null,{"$f":"IF(AND(tbl_ER_P2Coi47[[#Totals],[Allowed Claims]]<CF73,CH73<>\"Fail\",CH73<>\"N/A\"),\"Add missing cost share values.\",IF(CF107>CG55,\"Allowed claims higher than possible; correct entries.\",\"\"))","v":""},null,null,null,null,"Total",{"$f":"SUBTOTAL(109,tbl_RX_P2Coi52[Allowed Claims])","v":0},{"$f":"SUBTOTAL(109,tbl_RX_P2Coi52[Portion])","v":0},null,{"$f":"IF(AND(tbl_RX_P2Coi52[[#Totals],[Allowed Claims]]<CO73,CQ73<>\"Fail\",CQ73<>\"N/A\"),\"Add missing cost share values.\",IF(CO107>CP55,\"Allowed claims higher than possible; correct entries.\",\"\"))","v":""}]
[null,null,null,null,null,null,null,null,null,null,"Total",{"$f":"SUBTOTAL(109,tbl_IPINN_P2Coi8[Allowed Claims])","v":346},{"$f":"SUBTOTAL(109,tbl_IPINN_P2Coi8[Portion])","v":1},null,{"$f":"IF(AND(tbl_IPINN_P2Coi8[[#Totals],[Allowed Claims]]<L73,N73<>\"Fail\",N73<>\"N/A\"),\"Add missing cost share values.\",IF(L108>M55,\"Allowed claims higher than possible; correct entries.\",\"\"))","v":""}]
[null,null,null,null,null,null,null,null,null,null,null,null,null,null,null,null,null,null,null,{"$f":"T113&\" ---- \"&U$40","v":"OOPM ---- (2) Inpatient, Out-of-Network (IP OON)"},null,null,"Errors found:",{"$f":"COUNTIF(tbl_IPOON_P2OOPM14[[#Data],[#Totals],[Error Checking]],\"?*\")","v":0},null,null,null,null,{"$f":"AC113&\" ---- \"&AD$40","v":"OOPM ---- (3) Outpatient, In-Network (OP INN)"},null,null,"Errors found:",{"$f":"COUNTIF(tbl_OPINN_P2OOPM19[[#Data],[#Totals],[Error Checking]],\"?*\")","v":0},null,null,null,null,{"$f":"AL113&\" ---- \"&AM$40","v":"OOPM ---- (3a) Outpatient - Office Visits, In-Network (OP-OV INN)"},null,null,"Errors found:",{"$f":"COUNTIF(tbl_OPOVINN_P2OOPM24[[#Data],[#Totals],[Error Checking]],\"?*\")","v":0},null,null,null,null,{"$f":"AU113&\" ---- \"&AV$40","v":"OOPM ---- (3b) Outpatient - All Other, In-Network (OP-AO INN)"},null,null,"Errors found:",{"$f":"COUNTIF(tbl_OPAOINN_P2OOPM29[[#Data],[#Totals],[Error Checking]],\"?*\")","v":0},null,null,null,null,{"$f":"BD113&\" ---- \"&BE$40","v":"OOPM ---- (4) Outpatient, Out-of-Network (OP OON)"},null,null,"Errors found:",{"$f":"COUNTIF(tbl_OPOON_P2OOPM34[[#Data],[#Totals],[Error Checking]],\"?*\")","v":0},null,null,null,null,{"$f":"BM113&\" ---- \"&BN$40","v":"OOPM ---- (4a) Outpatient - Office Visits, Out-of-Network (OP-OV OON)"},null,null,"Errors found:",{"$f":"COUNTIF(tbl_OPOVOON_P2OOPM39[[#Data],[#Totals],[Error Checking]],\"?*\")","v":0},null,null,null,null,{"$f":"BV113&\" ---- \"&BW$40","v":"OOPM ---- (4b) Outpatient - All Other, Out-of-Network (OP-AO OON)"},null,null,"Errors found:",{"$f":"COUNTIF(tbl_OPAOOON_P2OOPM44[[#Data],[#Totals],[Error Checking]],\"?*\")","v":0},null,null,null,null,{"$f":"CE113&\" ---- \"&CF$40","v":"OOPM ---- (5) Emergency Care,  (ER )"},null,null,"Errors found:",{"$f":"COUNTIF(tbl_ER_P2OOPM48[[#Data],[#Totals],[Error Checking]],\"?*\")","v":0},null,null,null,null,{"$f":"CN113&\" ---- \"&CO$40","v":"OOPM ---- (6) Prescription Drugs,  (RX )"},null,null,"Errors found:",{"$f":"COUNTIF(tbl_RX_P2OOPM53[[#Data],[#Totals],[Error Checking]],\"?*\")","v":0}]
[null,null,null,null,null,null,null,null,null,null,{"$f":"K114&\" ---- \"&L$40","v":"OOPM ---- (1) Inpatient, In-Network (IP INN)"},null,null,"Errors found:",{"$f":"COUNTIF(tbl_IPINN_P2OOPM9[[#Data],[#Totals],[Error Checking]],\"?*\")","v":4},null,null,null,null,{"$f":"IF(INDEX(V$71:V$74,MATCH(T113,T$71:T$74,0))=\"\",\"If testing is required for this benefit classification: \nPlease ensure each different cost-share combination is entered above in PART 1.\",IF(INDEX(V$71:V$74,MATCH(T113,T$71:T$74,0))>=(2/3),\"Applies to substantially all medical/surgical benefits in this classification.\nENTER different \"&LOWER(T113)&\" amounts from smallest to largest.\",\"Does not apply to substantially all medical/surgical benefits in this classification. \nDELETE any values in the left-hand column below.\"))","v":"Applies to substantially all medical/surgical benefits in this classification.\nENTER different oopm amounts from smallest to largest."},null,null,null,null,null,null,null,null,{"$f":"IF(INDEX(AE$71:AE$74,MATCH(AC113,AC$71:AC$74,0))=\"\",\"If testing is required for this benefit classification: \nPlease ensure each different cost-share combination is entered above in PART 1.\",IF(INDEX(AE$71:AE$74,MATCH(AC113,AC$71:AC$74,0))>=(2/3),\"Applies to substantially all medical/surgical benefits in this classification.\nENTER different \"&LOWER(AC113)&\" amounts from smallest to largest.\",\"Does not apply to substantially all medical/surgical benefits in this classification. \nDELETE any values in the left-hand column below.\"))","v":"If testing is required for this benefit classification: \nPlease ensure each different cost-share combination is entered above in PART 1."},null,null,null,null,null,null,null,null,{"$f":"IF(INDEX(AN$71:AN$74,MATCH(AL113,AL$71:AL$74,0))=\"\",\"If testing is required for this benefit classification: \nPlease ensure each different cost-share combination is entered above in PART 1.\",IF(INDEX(AN$71:AN$74,MATCH(AL113,AL$71:AL$74,0))>=(2/3),\"Applies to substantially all medical/surgical benefits in this classification.\nENTER different \"&LOWER(AL113)&\" amounts from smallest to largest.\",\"Does not apply to substantially all medical/surgical benefits in this classification. \nDELETE any values in the left-hand column below.\"))","v":"If testing is required for this benefit classification: \nPlease ensure each different cost-share combination is entered above in PART 1."},null,null,null,null,null,null,null,null,{"$f":"IF(INDEX(AW$71:AW$74,MATCH(AU113,AU$71:AU$74,0))=\"\",\"If testing is required for this benefit classification: \nPlease ensure each different cost-share combination is entered above in PART 1.\",IF(INDEX(AW$71:AW$74,MATCH(AU113,AU$71:AU$74,0))>=(2/3),\"Applies to substantially all medical/surgical benefits in this classification.\nENTER different \"&LOWER(AU113)&\" amounts from smallest to largest.\",\"Does not apply to substantially all medical/surgical benefits in this classification. \nDELETE any values in the left-hand column below.\"))","v":"If testing is required for this benefit classification: \nPlease ensure each different cost-share combination is entered above in PART 1."},null,null,null,null,null,null,null,null,{"$f":"IF(INDEX(BF$71:BF$74,MATCH(BD113,BD$71:BD$74,0))=\"\",\"If testing is required for this benefit classification: \nPlease ensure each different cost-share combination is entered above in PART 1.\",IF(INDEX(BF$71:BF$74,MATCH(BD113,BD$71:BD$74,0))>=(2/3),\"Applies to substantially all medical/surgical benefits in this classification.\nENTER different \"&LOWER(BD113)&\" amounts from smallest to largest.\",\"Does not apply to substantially all medical/surgical benefits in this classification. \nDELETE any values in the left-hand column below.\"))","v":"If testing is required for this benefit classification: \nPlease ensure each different cost-share combination is entered above in PART 1."},null,null,null,null,null,null,null,null,{"$f":"IF(INDEX(BO$71:BO$74,MATCH(BM113,BM$71:BM$74,0))=\"\",\"If testing is required for this benefit classification: \nPlease ensure each different cost-share combination is entered above in PART 1.\",IF(INDEX(BO$71:BO$74,MATCH(BM113,BM$71:BM$74,0))>=(2/3),\"Applies to substantially all medical/surgical benefits in this classification.\nENTER different \"&LOWER(BM113)&\" amounts from smallest to largest.\",\"Does not apply to substantially all medical/surgical benefits in this classification. \nDELETE any values in the left-hand column below.\"))","v":"If testing is required for this benefit classification: \nPlease ensure each different cost-share combination is entered above in PART 1."},null,null,null,null,null,null,null,null,{"$f":"IF(INDEX(BX$71:BX$74,MATCH(BV113,BV$71:BV$74,0))=\"\",\"If testing is required for this benefit classification: \nPlease ensure each different cost-share combination is entered above in PART 1.\",IF(INDEX(BX$71:BX$74,MATCH(BV113,BV$71:BV$74,0))>=(2/3),\"Applies to substantially all medical/surgical benefits in this classification.\nENTER different \"&LOWER(BV113)&\" amounts from smallest to largest.\",\"Does not apply to substantially all medical/surgical benefits in this classification. \nDELETE any values in the left-hand column below.\"))","v":"If testing is required for this benefit classification: \nPlease ensure each different cost-share combination is entered above in PART 1."},null,null,null,null,null,null,null,null,{"$f":"IF(INDEX(CG$71:CG$74,MATCH(CE113,CE$71:CE$74,0))=\"\",\"If testing is required for this benefit classification: \nPlease ensure each different cost-share combination is entered above in PART 1.\",IF(INDEX(CG$71:CG$74,MATCH(CE113,CE$71:CE$74,0))>=(2/3),\"Applies to substantially all medical/surgical benefits in this classification.\nENTER different \"&LOWER(CE113)&\" amounts from smallest to largest.\",\"Does not apply to substantially all medical/surgical benefits in this classification. \nDELETE any values in the left-hand column below.\"))","v":"If testing is required for this benefit classification: \nPlease ensure each different cost-share combination is entered above in PART 1."},null,null,null,null,null,null,null,null,{"$f":"IF(INDEX(CP$71:CP$74,MATCH(CN113,CN$71:CN$74,0))=\"\",\"If testing is required for this benefit classification: \nPlease ensure each different cost-share combination is entered above in PART 1.\",IF(INDEX(CP$71:CP$74,MATCH(CN113,CN$71:CN$74,0))>=(2/3),\"Applies to substantially all medical/surgical benefits in this classification.\nENTER different \"&LOWER(CN113)&\" amounts from smallest to largest.\",\"Does not apply to substantially all medical/surgical benefits in this classification. \nDELETE any values in the left-hand column below.\"))","v":"If testing is required for this benefit classification: \nPlease ensure each different cost-share combination is entered above in PART 1."}]
[null,null,null,null,null,null,null,null,null,null,{"$f":"IF(INDEX(M$71:M$74,MATCH(K114,K$71:K$74,0))=\"\",\"If testing is required for this benefit classification: \nPlease ensure each different cost-share combination is entered above in PART 1.\",IF(INDEX(M$71:M$74,MATCH(K114,K$71:K$74,0))>=(2/3),\"Applies to substantially all medical/surgical benefits in this classification.\nENTER different \"&LOWER(K114)&\" amounts from smallest to largest.\",\"Does not apply to substantially all medical/surgical benefits in this classification. \nDELETE any values in the left-hand column below.\"))","v":"Applies to substantially all medical/surgical benefits in this classification.\nENTER different oopm amounts from smallest to largest."}]
[]
[null,null,null,null,null,null,null,null,null,null,null,null,null,null,null,null,null,null,null,"OOPM","Allowed Claims","Portion","Predominant & Smaller","Error Checking",null,null,null,null,"OOPM","Allowed Claims","Portion","Predominant & Smaller","Error Checking",null,null,null,null,"OOPM","Allowed Claims","Portion","Predominant & Smaller","Error Checking",null,null,null,null,"OOPM","Allowed Claims","Portion","Predominant & Smaller","Error Checking",null,null,null,null,"OOPM","Allowed Claims","Portion","Predominant & Smaller","Error Checking",null,null,null,null,"OOPM","Allowed Claims","Portion","Predominant & Smaller","Error Checking",null,null,null,null,"OOPM","Allowed Claims","Portion","Predominant & Smaller","Error Checking",null,null,null,null,"OOPM","Allowed Claims","Portion","Predominant & Smaller","Error Checking",null,null,null,null,"OOPM","Allowed Claims","Portion","Predominant & Smaller","Error Checking"]
[null,null,null,null,null,null,null,null,null,null,"OOPM","Allowed Claims","Portion","Predominant & Smaller","Error Checking",null,null,null,null,8000,{"$f":"SUMIF(tbl_IPOON_P110[Out-of-Pocket Maximum (OOPM)],T114,tbl_IPOON_P110[Plan Projected Allowed Amount])","v":659},{"$f":"IF(OR(U114=0,U114=\"\"),\"\",U114/tbl_IPOON_P2OOPM14[[#Totals],[Allowed Claims]])","v":1},{"$f":"IF(V114=\"\",\"\",IF(SUMIF(tbl_IPOON_P2OOPM14[OOPM],\">=\"&T114,tbl_IPOON_P2OOPM14[Portion])>0.5,T114,\"\"))","v":8000},{"$f":"IF(COUNTIF(tbl_IPOON_P2OOPM14[OOPM],tbl_IPOON_P2OOPM14[[#This Row],[OOPM]])>1,\"Remove Duplicate Entry.\",IF(AND(tbl_IPOON_P2OOPM14[[#This Row],[OOPM]]<>\"\",tbl_IPOON_P2OOPM14[[#This Row],[Allowed Claims]]=0),\"Entry not found in Part 1 Table\",IF(AND(OFFSET(tbl_IPOON_P2OOPM14[[#This Row],[OOPM]],1,0)<>\"Total\",OFFSET(tbl_IPOON_P2OOPM14[[#This Row],[OOPM]],1,0)<>\"\",OFFSET(tbl_IPOON_P2OOPM14[[#This Row],[OOPM]],1,0)<tbl_IPOON_P2OOPM14[[#This Row],[OOPM]]),\"Sort Entries from lowest to highest\",\"\")))","v":""},null,null,null,null,null,{"$f":"SUMIF(tbl_OPINN_P115[Out-of-Pocket Maximum (OOPM)],AC114,tbl_OPINN_P115[Plan Projected Allowed Amount])","v":0},{"$f":"IF(OR(AD114=0,AD114=\"\"),\"\",AD114/tbl_OPINN_P2OOPM19[[#Totals],[Allowed Claims]])","v":""},{"$f":"IF(AE114=\"\",\"\",IF(SUMIF(tbl_OPINN_P2OOPM19[OOPM],\">=\"&AC114,tbl_OPINN_P2OOPM19[Portion])>0.5,AC114,\"\"))","v":""},{"$f":"IF(COUNTIF(tbl_OPINN_P2OOPM19[OOPM],tbl_OPINN_P2OOPM19[[#This Row],[OOPM]])>1,\"Remove Duplicate Entry.\",IF(AND(tbl_OPINN_P2OOPM19[[#This Row],[OOPM]]<>\"\",tbl_OPINN_P2OOPM19[[#This Row],[Allowed Claims]]=0),\"Entry not found in Part 1 Table\",IF(AND(OFFSET(tbl_OPINN_P2OOPM19[[#This Row],[OOPM]],1,0)<>\"Total\",OFFSET(tbl_OPINN_P2OOPM19[[#This Row],[OOPM]],1,0)<>\"\",OFFSET(tbl_OPINN_P2OOPM19[[#This Row],[OOPM]],1,0)<tbl_OPINN_P2OOPM19[[#This Row],[OOPM]]),\"Sort Entries from lowest to highest\",\"\")))","v":""},null,null,null,null,null,{"$f":"SUMIF(tbl_OPOVINN_P120[Out-of-Pocket Maximum (OOPM)],AL114,tbl_OPOVINN_P120[Plan Projected Allowed Amount])","v":0},{"$f":"IF(OR(AM114=0,AM114=\"\"),\"\",AM114/tbl_OPOVINN_P2OOPM24[[#Totals],[Allowed Claims]])","v":""},{"$f":"IF(AN114=\"\",\"\",IF(SUMIF(tbl_OPOVINN_P2OOPM24[OOPM],\">=\"&AL114,tbl_OPOVINN_P2OOPM24[Portion])>0.5,AL114,\"\"))","v":""},{"$f":"IF(COUNTIF(tbl_OPOVINN_P2OOPM24[OOPM],tbl_OPOVINN_P2OOPM24[[#This Row],[OOPM]])>1,\"Remove Duplicate Entry.\",IF(AND(tbl_OPOVINN_P2OOPM24[[#This Row],[OOPM]]<>\"\",tbl_OPOVINN_P2OOPM24[[#This Row],[Allowed Claims]]=0),\"Entry not found in Part 1 Table\",IF(AND(OFFSET(tbl_OPOVINN_P2OOPM24[[#This Row],[OOPM]],1,0)<>\"Total\",OFFSET(tbl_OPOVINN_P2OOPM24[[#This Row],[OOPM]],1,0)<>\"\",OFFSET(tbl_OPOVINN_P2OOPM24[[#This Row],[OOPM]],1,0)<tbl_OPOVINN_P2OOPM24[[#This Row],[OOPM]]),\"Sort Entries from lowest to highest\",\"\")))","v":""},null,null,null,null,null,{"$f":"SUMIF(tbl_OPAOINN_P125[Out-of-Pocket Maximum (OOPM)],AU114,tbl_OPAOINN_P125[Plan Projected Allowed Amount])","v":0},{"$f":"IF(OR(AV114=0,AV114=\"\"),\"\",AV114/tbl_OPAOINN_P2OOPM29[[#Totals],[Allowed Claims]])","v":""},{"$f":"IF(AW114=\"\",\"\",IF(SUMIF(tbl_OPAOINN_P2OOPM29[OOPM],\">=\"&AU114,tbl_OPAOINN_P2OOPM29[Portion])>0.5,AU114,\"\"))","v":""},{"$f":"IF(COUNTIF(tbl_OPAOINN_P2OOPM29[OOPM],tbl_OPAOINN_P2OOPM29[[#This Row],[OOPM]])>1,\"Remove Duplicate Entry.\",IF(AND(tbl_OPAOINN_P2OOPM29[[#This Row],[OOPM]]<>\"\",tbl_OPAOINN_P2OOPM29[[#This Row],[Allowed Claims]]=0),\"Entry not found in Part 1 Table\",IF(AND(OFFSET(tbl_OPAOINN_P2OOPM29[[#This Row],[OOPM]],1,0)<>\"Total\",OFFSET(tbl_OPAOINN_P2OOPM29[[#This Row],[OOPM]],1,0)<>\"\",OFFSET(tbl_OPAOINN_P2OOPM29[[#This Row],[OOPM]],1,0)<tbl_OPAOINN_P2OOPM29[[#This Row],[OOPM]]),\"Sort Entries from lowest to highest\",\"\")))","v":""},null,null,null,null,null,{"$f":"SUMIF(tbl_OPOON_P130[Out-of-Pocket Maximum (OOPM)],BD114,tbl_OPOON_P130[Plan Projected Allowed Amount])","v":0},{"$f":"IF(OR(BE114=0,BE114=\"\"),\"\",BE114/tbl_OPOON_P2OOPM34[[#Totals],[Allowed Claims]])","v":""},{"$f":"IF(BF114=\"\",\"\",IF(SUMIF(tbl_OPOON_P2OOPM34[OOPM],\">=\"&BD114,tbl_OPOON_P2OOPM34[Portion])>0.5,BD114,\"\"))","v":""},{"$f":"IF(COUNTIF(tbl_OPOON_P2OOPM34[OOPM],tbl_OPOON_P2OOPM34[[#This Row],[OOPM]])>1,\"Remove Duplicate Entry.\",IF(AND(tbl_OPOON_P2OOPM34[[#This Row],[OOPM]]<>\"\",tbl_OPOON_P2OOPM34[[#This Row],[Allowed Claims]]=0),\"Entry not found in Part 1 Table\",IF(AND(OFFSET(tbl_OPOON_P2OOPM34[[#This Row],[OOPM]],1,0)<>\"Total\",OFFSET(tbl_OPOON_P2OOPM34[[#This Row],[OOPM]],1,0)<>\"\",OFFSET(tbl_OPOON_P2OOPM34[[#This Row],[OOPM]],1,0)<tbl_OPOON_P2OOPM34[[#This Row],[OOPM]]),\"Sort Entries from lowest to highest\",\"\")))","v":""},null,null,null,null,null,{"$f":"SUMIF(tbl_OPOVOON_P135[Out-of-Pocket Maximum (OOPM)],BM114,tbl_OPOVOON_P135[Plan Projected Allowed Amount])","v":0},{"$f":"IF(OR(BN114=0,BN114=\"\"),\"\",BN114/tbl_OPOVOON_P2OOPM39[[#Totals],[Allowed Claims]])","v":""},{"$f":"IF(BO114=\"\",\"\",IF(SUMIF(tbl_OPOVOON_P2OOPM39[OOPM],\">=\"&BM114,tbl_OPOVOON_P2OOPM39[Portion])>0.5,BM114,\"\"))","v":""},{"$f":"IF(COUNTIF(tbl_OPOVOON_P2OOPM39[OOPM],tbl_OPOVOON_P2OOPM39[[#This Row],[OOPM]])>1,\"Remove Duplicate Entry.\",IF(AND(tbl_OPOVOON_P2OOPM39[[#This Row],[OOPM]]<>\"\",tbl_OPOVOON_P2OOPM39[[#This Row],[Allowed Claims]]=0),\"Entry not found in Part 1 Table\",IF(AND(OFFSET(tbl_OPOVOON_P2OOPM39[[#This Row],[OOPM]],1,0)<>\"Total\",OFFSET(tbl_OPOVOON_P2OOPM39[[#This Row],[OOPM]],1,0)<>\"\",OFFSET(tbl_OPOVOON_P2OOPM39[[#This Row],[OOPM]],1,0)<tbl_OPOVOON_P2OOPM39[[#This Row],[OOPM]]),\"Sort Entries from lowest to highest\",\"\")))","v":""},null,null,null,null,null,{"$f":"SUMIF(tbl_OPAOOON_P140[Out-of-Pocket Maximum (OOPM)],BV114,tbl_OPAOOON_P140[Plan Projected Allowed Amount])","v":0},{"$f":"IF(OR(BW114=0,BW114=\"\"),\"\",BW114/tbl_OPAOOON_P2OOPM44[[#Totals],[Allowed Claims]])","v":""},{"$f":"IF(BX114=\"\",\"\",IF(SUMIF(tbl_OPAOOON_P2OOPM44[OOPM],\">=\"&BV114,tbl_OPAOOON_P2OOPM44[Portion])>0.5,BV114,\"\"))","v":""},{"$f":"IF(COUNTIF(tbl_OPAOOON_P2OOPM44[OOPM],tbl_OPAOOON_P2OOPM44[[#This Row],[OOPM]])>1,\"Remove Duplicate Entry.\",IF(AND(tbl_OPAOOON_P2OOPM44[[#This Row],[OOPM]]<>\"\",tbl_OPAOOON_P2OOPM44[[#This Row],[Allowed Claims]]=0),\"Entry not found in Part 1 Table\",IF(AND(OFFSET(tbl_OPAOOON_P2OOPM44[[#This Row],[OOPM]],1,0)<>\"Total\",OFFSET(tbl_OPAOOON_P2OOPM44[[#This Row],[OOPM]],1,0)<>\"\",OFFSET(tbl_OPAOOON_P2OOPM44[[#This Row],[OOPM]],1,0)<tbl_OPAOOON_P2OOPM44[[#This Row],[OOPM]]),\"Sort Entries from lowest to highest\",\"\")))","v":""},null,null,null,null,null,{"$f":"SUMIF(tbl_ER_P145[Out-of-Pocket Maximum (OOPM)],CE114,tbl_ER_P145[Plan Projected Allowed Amount])","v":0},{"$f":"IF(OR(CF114=0,CF114=\"\"),\"\",CF114/tbl_ER_P2OOPM48[[#Totals],[Allowed Claims]])","v":""},{"$f":"IF(CG114=\"\",\"\",IF(SUMIF(tbl_ER_P2OOPM48[OOPM],\">=\"&CE114,tbl_ER_P2OOPM48[Portion])>0.5,CE114,\"\"))","v":""},{"$f":"IF(COUNTIF(tbl_ER_P2OOPM48[OOPM],tbl_ER_P2OOPM48[[#This Row],[OOPM]])>1,\"Remove Duplicate Entry.\",IF(AND(tbl_ER_P2OOPM48[[#This Row],[OOPM]]<>\"\",tbl_ER_P2OOPM48[[#This Row],[Allowed Claims]]=0),\"Entry not found in Part 1 Table\",IF(AND(OFFSET(tbl_ER_P2OOPM48[[#This Row],[OOPM]],1,0)<>\"Total\",OFFSET(tbl_ER_P2OOPM48[[#This Row],[OOPM]],1,0)<>\"\",OFFSET(tbl_ER_P2OOPM48[[#This Row],[OOPM]],1,0)<tbl_ER_P2OOPM48[[#This Row],[OOPM]]),\"Sort Entries from lowest to highest\",\"\")))","v":""},null,null,null,null,null,{"$f":"SUMIF(tbl_RX_P149[Out-of-Pocket Maximum (OOPM)],CN114,tbl_RX_P149[Plan Projected Allowed Amount])","v":0},{"$f":"IF(OR(CO114=0,CO114=\"\"),\"\",CO114/tbl_RX_P2OOPM53[[#Totals],[Allowed Claims]])","v":""},{"$f":"IF(CP114=\"\",\"\",IF(SUMIF(tbl_RX_P2OOPM53[OOPM],\">=\"&CN114,tbl_RX_P2OOPM53[Portion])>0.5,CN114,\"\"))","v":""},{"$f":"IF(COUNTIF(tbl_RX_P2OOPM53[OOPM],tbl_RX_P2OOPM53[[#This Row],[OOPM]])>1,\"Remove Duplicate Entry.\",IF(AND(tbl_RX_P2OOPM53[[#This Row],[OOPM]]<>\"\",tbl_RX_P2OOPM53[[#This Row],[Allowed Claims]]=0),\"Entry not found in Part 1 Table\",IF(AND(OFFSET(tbl_RX_P2OOPM53[[#This Row],[OOPM]],1,0)<>\"Total\",OFFSET(tbl_RX_P2OOPM53[[#This Row],[OOPM]],1,0)<>\"\",OFFSET(tbl_RX_P2OOPM53[[#This Row],[OOPM]],1,0)<tbl_RX_P2OOPM53[[#This Row],[OOPM]]),\"Sort Entries from lowest to highest\",\"\")))","v":""}]
[null,null,null,null,null,null,null,null,null,null,8000,{"$f":"SUMIF(tbl_IPINN_P15[Out-of-Pocket Maximum (OOPM)],K115,tbl_IPINN_P15[Plan Projected Allowed Amount])","v":2285},{"$f":"IF(OR(L115=0,L115=\"\"),\"\",L115/tbl_IPINN_P2OOPM9[[#Totals],[Allowed Claims]])","v":0.5},{"$f":"IF(M115=\"\",\"\",IF(SUMIF(tbl_IPINN_P2OOPM9[OOPM],\">=\"&K115,tbl_IPINN_P2OOPM9[Portion])>0.5,K115,\"\"))","v":8000},{"$f":"IF(COUNTIF(tbl_IPINN_P2OOPM9[OOPM],tbl_IPINN_P2OOPM9[[#This Row],[OOPM]])>1,\"Remove Duplicate Entry.\",IF(AND(tbl_IPINN_P2OOPM9[[#This Row],[OOPM]]<>\"\",tbl_IPINN_P2OOPM9[[#This Row],[Allowed Claims]]=0),\"Entry not found in Part 1 Table\",IF(AND(OFFSET(tbl_IPINN_P2OOPM9[[#This Row],[OOPM]],1,0)<>\"Total\",OFFSET(tbl_IPINN_P2OOPM9[[#This Row],[OOPM]],1,0)<>\"\",OFFSET(tbl_IPINN_P2OOPM9[[#This Row],[OOPM]],1,0)<tbl_IPINN_P2OOPM9[[#This Row],[OOPM]]),\"Sort Entries from lowest to highest\",\"\")))","v":"Remove Duplicate Entry."},null,null,null,null,null,{"$f":"SUMIF(tbl_IPOON_P110[Out-of-Pocket Maximum (OOPM)],T115,tbl_IPOON_P110[Plan Projected Allowed Amount])","v":0},{"$f":"IF(OR(U115=0,U115=\"\"),\"\",U115/tbl_IPOON_P2OOPM14[[#Totals],[Allowed Claims]])","v":""},{"$f":"IF(V115=\"\",\"\",IF(SUMIF(tbl_IPOON_P2OOPM14[OOPM],\">=\"&T115,tbl_IPOON_P2OOPM14[Portion])>0.5,T115,\"\"))","v":""},{"$f":"IF(COUNTIF(tbl_IPOON_P2OOPM14[OOPM],tbl_IPOON_P2OOPM14[[#This Row],[OOPM]])>1,\"Remove Duplicate Entry.\",IF(AND(tbl_IPOON_P2OOPM14[[#This Row],[OOPM]]<>\"\",tbl_IPOON_P2OOPM14[[#This Row],[Allowed Claims]]=0),\"Entry not found in Part 1 Table\",IF(AND(OFFSET(tbl_IPOON_P2OOPM14[[#This Row],[OOPM]],1,0)<>\"Total\",OFFSET(tbl_IPOON_P2OOPM14[[#This Row],[OOPM]],1,0)<>\"\",OFFSET(tbl_IPOON_P2OOPM14[[#This Row],[OOPM]],1,0)<tbl_IPOON_P2OOPM14[[#This Row],[OOPM]]),\"Sort Entries from lowest to highest\",\"\")))","v":""},null,null,null,null,null,{"$f":"SUMIF(tbl_OPINN_P115[Out-of-Pocket Maximum (OOPM)],AC115,tbl_OPINN_P115[Plan Projected Allowed Amount])","v":0},{"$f":"IF(OR(AD115=0,AD115=\"\"),\"\",AD115/tbl_OPINN_P2OOPM19[[#Totals],[Allowed Claims]])","v":""},{"$f":"IF(AE115=\"\",\"\",IF(SUMIF(tbl_OPINN_P2OOPM19[OOPM],\">=\"&AC115,tbl_OPINN_P2OOPM19[Portion])>0.5,AC115,\"\"))","v":""},{"$f":"IF(COUNTIF(tbl_OPINN_P2OOPM19[OOPM],tbl_OPINN_P2OOPM19[[#This Row],[OOPM]])>1,\"Remove Duplicate Entry.\",IF(AND(tbl_OPINN_P2OOPM19[[#This Row],[OOPM]]<>\"\",tbl_OPINN_P2OOPM19[[#This Row],[Allowed Claims]]=0),\"Entry not found in Part 1 Table\",IF(AND(OFFSET(tbl_OPINN_P2OOPM19[[#This Row],[OOPM]],1,0)<>\"Total\",OFFSET(tbl_OPINN_P2OOPM19[[#This Row],[OOPM]],1,0)<>\"\",OFFSET(tbl_OPINN_P2OOPM19[[#This Row],[OOPM]],1,0)<tbl_OPINN_P2OOPM19[[#This Row],[OOPM]]),\"Sort Entries from lowest to highest\",\"\")))","v":""},null,null,null,null,null,{"$f":"SUMIF(tbl_OPOVINN_P120[Out-of-Pocket Maximum (OOPM)],AL115,tbl_OPOVINN_P120[Plan Projected Allowed Amount])","v":0},{"$f":"IF(OR(AM115=0,AM115=\"\"),\"\",AM115/tbl_OPOVINN_P2OOPM24[[#Totals],[Allowed Claims]])","v":""},{"$f":"IF(AN115=\"\",\"\",IF(SUMIF(tbl_OPOVINN_P2OOPM24[OOPM],\">=\"&AL115,tbl_OPOVINN_P2OOPM24[Portion])>0.5,AL115,\"\"))","v":""},{"$f":"IF(COUNTIF(tbl_OPOVINN_P2OOPM24[OOPM],tbl_OPOVINN_P2OOPM24[[#This Row],[OOPM]])>1,\"Remove Duplicate Entry.\",IF(AND(tbl_OPOVINN_P2OOPM24[[#This Row],[OOPM]]<>\"\",tbl_OPOVINN_P2OOPM24[[#This Row],[Allowed Claims]]=0),\"Entry not found in Part 1 Table\",IF(AND(OFFSET(tbl_OPOVINN_P2OOPM24[[#This Row],[OOPM]],1,0)<>\"Total\",OFFSET(tbl_OPOVINN_P2OOPM24[[#This Row],[OOPM]],1,0)<>\"\",OFFSET(tbl_OPOVINN_P2OOPM24[[#This Row],[OOPM]],1,0)<tbl_OPOVINN_P2OOPM24[[#This Row],[OOPM]]),\"Sort Entries from lowest to highest\",\"\")))","v":""},null,null,null,null,null,{"$f":"SUMIF(tbl_OPAOINN_P125[Out-of-Pocket Maximum (OOPM)],AU115,tbl_OPAOINN_P125[Plan Projected Allowed Amount])","v":0},{"$f":"IF(OR(AV115=0,AV115=\"\"),\"\",AV115/tbl_OPAOINN_P2OOPM29[[#Totals],[Allowed Claims]])","v":""},{"$f":"IF(AW115=\"\",\"\",IF(SUMIF(tbl_OPAOINN_P2OOPM29[OOPM],\">=\"&AU115,tbl_OPAOINN_P2OOPM29[Portion])>0.5,AU115,\"\"))","v":""},{"$f":"IF(COUNTIF(tbl_OPAOINN_P2OOPM29[OOPM],tbl_OPAOINN_P2OOPM29[[#This Row],[OOPM]])>1,\"Remove Duplicate Entry.\",IF(AND(tbl_OPAOINN_P2OOPM29[[#This Row],[OOPM]]<>\"\",tbl_OPAOINN_P2OOPM29[[#This Row],[Allowed Claims]]=0),\"Entry not found in Part 1 Table\",IF(AND(OFFSET(tbl_OPAOINN_P2OOPM29[[#This Row],[OOPM]],1,0)<>\"Total\",OFFSET(tbl_OPAOINN_P2OOPM29[[#This Row],[OOPM]],1,0)<>\"\",OFFSET(tbl_OPAOINN_P2OOPM29[[#This Row],[OOPM]],1,0)<tbl_OPAOINN_P2OOPM29[[#This Row],[OOPM]]),\"Sort Entries from lowest to highest\",\"\")))","v":""},null,null,null,null,null,{"$f":"SUMIF(tbl_OPOON_P130[Out-of-Pocket Maximum (OOPM)],BD115,tbl_OPOON_P130[Plan Projected Allowed Amount])","v":0},{"$f":"IF(OR(BE115=0,BE115=\"\"),\"\",BE115/tbl_OPOON_P2OOPM34[[#Totals],[Allowed Claims]])","v":""},{"$f":"IF(BF115=\"\",\"\",IF(SUMIF(tbl_OPOON_P2OOPM34[OOPM],\">=\"&BD115,tbl_OPOON_P2OOPM34[Portion])>0.5,BD115,\"\"))","v":""},{"$f":"IF(COUNTIF(tbl_OPOON_P2OOPM34[OOPM],tbl_OPOON_P2OOPM34[[#This Row],[OOPM]])>1,\"Remove Duplicate Entry.\",IF(AND(tbl_OPOON_P2OOPM34[[#This Row],[OOPM]]<>\"\",tbl_OPOON_P2OOPM34[[#This Row],[Allowed Claims]]=0),\"Entry not found in Part 1 Table\",IF(AND(OFFSET(tbl_OPOON_P2OOPM34[[#This Row],[OOPM]],1,0)<>\"Total\",OFFSET(tbl_OPOON_P2OOPM34[[#This Row],[OOPM]],1,0)<>\"\",OFFSET(tbl_OPOON_P2OOPM34[[#This Row],[OOPM]],1,0)<tbl_OPOON_P2OOPM34[[#This Row],[OOPM]]),\"Sort Entries from lowest to highest\",\"\")))","v":""},null,null,null,null,null,{"$f":"SUMIF(tbl_OPOVOON_P135[Out-of-Pocket Maximum (OOPM)],BM115,tbl_OPOVOON_P135[Plan Projected Allowed Amount])","v":0},{"$f":"IF(OR(BN115=0,BN115=\"\"),\"\",BN115/tbl_OPOVOON_P2OOPM39[[#Totals],[Allowed Claims]])","v":""},{"$f":"IF(BO115=\"\",\"\",IF(SUMIF(tbl_OPOVOON_P2OOPM39[OOPM],\">=\"&BM115,tbl_OPOVOON_P2OOPM39[Portion])>0.5,BM115,\"\"))","v":""},{"$f":"IF(COUNTIF(tbl_OPOVOON_P2OOPM39[OOPM],tbl_OPOVOON_P2OOPM39[[#This Row],[OOPM]])>1,\"Remove Duplicate Entry.\",IF(AND(tbl_OPOVOON_P2OOPM39[[#This Row],[OOPM]]<>\"\",tbl_OPOVOON_P2OOPM39[[#This Row],[Allowed Claims]]=0),\"Entry not found in Part 1 Table\",IF(AND(OFFSET(tbl_OPOVOON_P2OOPM39[[#This Row],[OOPM]],1,0)<>\"Total\",OFFSET(tbl_OPOVOON_P2OOPM39[[#This Row],[OOPM]],1,0)<>\"\",OFFSET(tbl_OPOVOON_P2OOPM39[[#This Row],[OOPM]],1,0)<tbl_OPOVOON_P2OOPM39[[#This Row],[OOPM]]),\"Sort Entries from lowest to highest\",\"\")))","v":""},null,null,null,null,null,{"$f":"SUMIF(tbl_OPAOOON_P140[Out-of-Pocket Maximum (OOPM)],BV115,tbl_OPAOOON_P140[Plan Projected Allowed Amount])","v":0},{"$f":"IF(OR(BW115=0,BW115=\"\"),\"\",BW115/tbl_OPAOOON_P2OOPM44[[#Totals],[Allowed Claims]])","v":""},{"$f":"IF(BX115=\"\",\"\",IF(SUMIF(tbl_OPAOOON_P2OOPM44[OOPM],\">=\"&BV115,tbl_OPAOOON_P2OOPM44[Portion])>0.5,BV115,\"\"))","v":""},{"$f":"IF(COUNTIF(tbl_OPAOOON_P2OOPM44[OOPM],tbl_OPAOOON_P2OOPM44[[#This Row],[OOPM]])>1,\"Remove Duplicate Entry.\",IF(AND(tbl_OPAOOON_P2OOPM44[[#This Row],[OOPM]]<>\"\",tbl_OPAOOON_P2OOPM44[[#This Row],[Allowed Claims]]=0),\"Entry not found in Part 1 Table\",IF(AND(OFFSET(tbl_OPAOOON_P2OOPM44[[#This Row],[OOPM]],1,0)<>\"Total\",OFFSET(tbl_OPAOOON_P2OOPM44[[#This Row],[OOPM]],1,0)<>\"\",OFFSET(tbl_OPAOOON_P2OOPM44[[#This Row],[OOPM]],1,0)<tbl_OPAOOON_P2OOPM44[[#This Row],[OOPM]]),\"Sort Entries from lowest to highest\",\"\")))","v":""},null,null,null,null,null,{"$f":"SUMIF(tbl_ER_P145[Out-of-Pocket Maximum (OOPM)],CE115,tbl_ER_P145[Plan Projected Allowed Amount])","v":0},{"$f":"IF(OR(CF115=0,CF115=\"\"),\"\",CF115/tbl_ER_P2OOPM48[[#Totals],[Allowed Claims]])","v":""},{"$f":"IF(CG115=\"\",\"\",IF(SUMIF(tbl_ER_P2OOPM48[OOPM],\">=\"&CE115,tbl_ER_P2OOPM48[Portion])>0.5,CE115,\"\"))","v":""},{"$f":"IF(COUNTIF(tbl_ER_P2OOPM48[OOPM],tbl_ER_P2OOPM48[[#This Row],[OOPM]])>1,\"Remove Duplicate Entry.\",IF(AND(tbl_ER_P2OOPM48[[#This Row],[OOPM]]<>\"\",tbl_ER_P2OOPM48[[#This Row],[Allowed Claims]]=0),\"Entry not found in Part 1 Table\",IF(AND(OFFSET(tbl_ER_P2OOPM48[[#This Row],[OOPM]],1,0)<>\"Total\",OFFSET(tbl_ER_P2OOPM48[[#This Row],[OOPM]],1,0)<>\"\",OFFSET(tbl_ER_P2OOPM48[[#This Row],[OOPM]],1,0)<tbl_ER_P2OOPM48[[#This Row],[OOPM]]),\"Sort Entries from lowest to highest\",\"\")))","v":""},null,null,null,null,null,{"$f":"SUMIF(tbl_RX_P149[Out-of-Pocket Maximum (OOPM)],CN115,tbl_RX_P149[Plan Projected Allowed Amount])","v":0},{"$f":"IF(OR(CO115=0,CO115=\"\"),\"\",CO115/tbl_RX_P2OOPM53[[#Totals],[Allowed Claims]])","v":""},{"$f":"IF(CP115=\"\",\"\",IF(SUMIF(tbl_RX_P2OOPM53[OOPM],\">=\"&CN115,tbl_RX_P2OOPM53[Portion])>0.5,CN115,\"\"))","v":""},{"$f":"IF(COUNTIF(tbl_RX_P2OOPM53[OOPM],tbl_RX_P2OOPM53[[#This Row],[OOPM]])>1,\"Remove Duplicate Entry.\",IF(AND(tbl_RX_P2OOPM53[[#This Row],[OOPM]]<>\"\",tbl_RX_P2OOPM53[[#This Row],[Allowed Claims]]=0),\"Entry not found in Part 1 Table\",IF(AND(OFFSET(tbl_RX_P2OOPM53[[#This Row],[OOPM]],1,0)<>\"Total\",OFFSET(tbl_RX_P2OOPM53[[#This Row],[OOPM]],1,0)<>\"\",OFFSET(tbl_RX_P2OOPM53[[#This Row],[OOPM]],1,0)<tbl_RX_P2OOPM53[[#This Row],[OOPM]]),\"Sort Entries from lowest to highest\",\"\")))","v":""}]
[null,null,null,null,null,null,null,null,null,null,9000,{"$f":"SUMIF(tbl_IPINN_P15[Out-of-Pocket Maximum (OOPM)],K116,tbl_IPINN_P15[Plan Projected Allowed Amount])","v":0},{"$f":"IF(OR(L116=0,L116=\"\"),\"\",L116/tbl_IPINN_P2OOPM9[[#Totals],[Allowed Claims]])","v":""},{"$f":"IF(M116=\"\",\"\",IF(SUMIF(tbl_IPINN_P2OOPM9[OOPM],\">=\"&K116,tbl_IPINN_P2OOPM9[Portion])>0.5,K116,\"\"))","v":""},{"$f":"IF(COUNTIF(tbl_IPINN_P2OOPM9[OOPM],tbl_IPINN_P2OOPM9[[#This Row],[OOPM]])>1,\"Remove Duplicate Entry.\",IF(AND(tbl_IPINN_P2OOPM9[[#This Row],[OOPM]]<>\"\",tbl_IPINN_P2OOPM9[[#This Row],[Allowed Claims]]=0),\"Entry not found in Part 1 Table\",IF(AND(OFFSET(tbl_IPINN_P2OOPM9[[#This Row],[OOPM]],1,0)<>\"Total\",OFFSET(tbl_IPINN_P2OOPM9[[#This Row],[OOPM]],1,0)<>\"\",OFFSET(tbl_IPINN_P2OOPM9[[#This Row],[OOPM]],1,0)<tbl_IPINN_P2OOPM9[[#This Row],[OOPM]]),\"Sort Entries from lowest to highest\",\"\")))","v":"Entry not found in Part 1 Table"},null,null,null,null,null,{"$f":"SUMIF(tbl_IPOON_P110[Out-of-Pocket Maximum (OOPM)],T116,tbl_IPOON_P110[Plan Projected Allowed Amount])","v":0},{"$f":"IF(OR(U116=0,U116=\"\"),\"\",U116/tbl_IPOON_P2OOPM14[[#Totals],[Allowed Claims]])","v":""},{"$f":"IF(V116=\"\",\"\",IF(SUMIF(tbl_IPOON_P2OOPM14[OOPM],\">=\"&T116,tbl_IPOON_P2OOPM14[Portion])>0.5,T116,\"\"))","v":""},{"$f":"IF(COUNTIF(tbl_IPOON_P2OOPM14[OOPM],tbl_IPOON_P2OOPM14[[#This Row],[OOPM]])>1,\"Remove Duplicate Entry.\",IF(AND(tbl_IPOON_P2OOPM14[[#This Row],[OOPM]]<>\"\",tbl_IPOON_P2OOPM14[[#This Row],[Allowed Claims]]=0),\"Entry not found in Part 1 Table\",IF(AND(OFFSET(tbl_IPOON_P2OOPM14[[#This Row],[OOPM]],1,0)<>\"Total\",OFFSET(tbl_IPOON_P2OOPM14[[#This Row],[OOPM]],1,0)<>\"\",OFFSET(tbl_IPOON_P2OOPM14[[#This Row],[OOPM]],1,0)<tbl_IPOON_P2OOPM14[[#This Row],[OOPM]]),\"Sort Entries from lowest to highest\",\"\")))","v":""},null,null,null,null,null,{"$f":"SUMIF(tbl_OPINN_P115[Out-of-Pocket Maximum (OOPM)],AC116,tbl_OPINN_P115[Plan Projected Allowed Amount])","v":0},{"$f":"IF(OR(AD116=0,AD116=\"\"),\"\",AD116/tbl_OPINN_P2OOPM19[[#Totals],[Allowed Claims]])","v":""},{"$f":"IF(AE116=\"\",\"\",IF(SUMIF(tbl_OPINN_P2OOPM19[OOPM],\">=\"&AC116,tbl_OPINN_P2OOPM19[Portion])>0.5,AC116,\"\"))","v":""},{"$f":"IF(COUNTIF(tbl_OPINN_P2OOPM19[OOPM],tbl_OPINN_P2OOPM19[[#This Row],[OOPM]])>1,\"Remove Duplicate Entry.\",IF(AND(tbl_OPINN_P2OOPM19[[#This Row],[OOPM]]<>\"\",tbl_OPINN_P2OOPM19[[#This Row],[Allowed Claims]]=0),\"Entry not found in Part 1 Table\",IF(AND(OFFSET(tbl_OPINN_P2OOPM19[[#This Row],[OOPM]],1,0)<>\"Total\",OFFSET(tbl_OPINN_P2OOPM19[[#This Row],[OOPM]],1,0)<>\"\",OFFSET(tbl_OPINN_P2OOPM19[[#This Row],[OOPM]],1,0)<tbl_OPINN_P2OOPM19[[#This Row],[OOPM]]),\"Sort Entries from lowest to highest\",\"\")))","v":""},null,null,null,null,null,{"$f":"SUMIF(tbl_OPOVINN_P120[Out-of-Pocket Maximum (OOPM)],AL116,tbl_OPOVINN_P120[Plan Projected Allowed Amount])","v":0},{"$f":"IF(OR(AM116=0,AM116=\"\"),\"\",AM116/tbl_OPOVINN_P2OOPM24[[#Totals],[Allowed Claims]])","v":""},{"$f":"IF(AN116=\"\",\"\",IF(SUMIF(tbl_OPOVINN_P2OOPM24[OOPM],\">=\"&AL116,tbl_OPOVINN_P2OOPM24[Portion])>0.5,AL116,\"\"))","v":""},{"$f":"IF(COUNTIF(tbl_OPOVINN_P2OOPM24[OOPM],tbl_OPOVINN_P2OOPM24[[#This Row],[OOPM]])>1,\"Remove Duplicate Entry.\",IF(AND(tbl_OPOVINN_P2OOPM24[[#This Row],[OOPM]]<>\"\",tbl_OPOVINN_P2OOPM24[[#This Row],[Allowed Claims]]=0),\"Entry not found in Part 1 Table\",IF(AND(OFFSET(tbl_OPOVINN_P2OOPM24[[#This Row],[OOPM]],1,0)<>\"Total\",OFFSET(tbl_OPOVINN_P2OOPM24[[#This Row],[OOPM]],1,0)<>\"\",OFFSET(tbl_OPOVINN_P2OOPM24[[#This Row],[OOPM]],1,0)<tbl_OPOVINN_P2OOPM24[[#This Row],[OOPM]]),\"Sort Entries from lowest to highest\",\"\")))","v":""},null,null,null,null,null,{"$f":"SUMIF(tbl_OPAOINN_P125[Out-of-Pocket Maximum (OOPM)],AU116,tbl_OPAOINN_P125[Plan Projected Allowed Amount])","v":0},{"$f":"IF(OR(AV116=0,AV116=\"\"),\"\",AV116/tbl_OPAOINN_P2OOPM29[[#Totals],[Allowed Claims]])","v":""},{"$f":"IF(AW116=\"\",\"\",IF(SUMIF(tbl_OPAOINN_P2OOPM29[OOPM],\">=\"&AU116,tbl_OPAOINN_P2OOPM29[Portion])>0.5,AU116,\"\"))","v":""},{"$f":"IF(COUNTIF(tbl_OPAOINN_P2OOPM29[OOPM],tbl_OPAOINN_P2OOPM29[[#This Row],[OOPM]])>1,\"Remove Duplicate Entry.\",IF(AND(tbl_OPAOINN_P2OOPM29[[#This Row],[OOPM]]<>\"\",tbl_OPAOINN_P2OOPM29[[#This Row],[Allowed Claims]]=0),\"Entry not found in Part 1 Table\",IF(AND(OFFSET(tbl_OPAOINN_P2OOPM29[[#This Row],[OOPM]],1,0)<>\"Total\",OFFSET(tbl_OPAOINN_P2OOPM29[[#This Row],[OOPM]],1,0)<>\"\",OFFSET(tbl_OPAOINN_P2OOPM29[[#This Row],[OOPM]],1,0)<tbl_OPAOINN_P2OOPM29[[#This Row],[OOPM]]),\"Sort Entries from lowest to highest\",\"\")))","v":""},null,null,null,null,null,{"$f":"SUMIF(tbl_OPOON_P130[Out-of-Pocket Maximum (OOPM)],BD116,tbl_OPOON_P130[Plan Projected Allowed Amount])","v":0},{"$f":"IF(OR(BE116=0,BE116=\"\"),\"\",BE116/tbl_OPOON_P2OOPM34[[#Totals],[Allowed Claims]])","v":""},{"$f":"IF(BF116=\"\",\"\",IF(SUMIF(tbl_OPOON_P2OOPM34[OOPM],\">=\"&BD116,tbl_OPOON_P2OOPM34[Portion])>0.5,BD116,\"\"))","v":""},{"$f":"IF(COUNTIF(tbl_OPOON_P2OOPM34[OOPM],tbl_OPOON_P2OOPM34[[#This Row],[OOPM]])>1,\"Remove Duplicate Entry.\",IF(AND(tbl_OPOON_P2OOPM34[[#This Row],[OOPM]]<>\"\",tbl_OPOON_P2OOPM34[[#This Row],[Allowed Claims]]=0),\"Entry not found in Part 1 Table\",IF(AND(OFFSET(tbl_OPOON_P2OOPM34[[#This Row],[OOPM]],1,0)<>\"Total\",OFFSET(tbl_OPOON_P2OOPM34[[#This Row],[OOPM]],1,0)<>\"\",OFFSET(tbl_OPOON_P2OOPM34[[#This Row],[OOPM]],1,0)<tbl_OPOON_P2OOPM34[[#This Row],[OOPM]]),\"Sort Entries from lowest to highest\",\"\")))","v":""},null,null,null,null,null,{"$f":"SUMIF(tbl_OPOVOON_P135[Out-of-Pocket Maximum (OOPM)],BM116,tbl_OPOVOON_P135[Plan Projected Allowed Amount])","v":0},{"$f":"IF(OR(BN116=0,BN116=\"\"),\"\",BN116/tbl_OPOVOON_P2OOPM39[[#Totals],[Allowed Claims]])","v":""},{"$f":"IF(BO116=\"\",\"\",IF(SUMIF(tbl_OPOVOON_P2OOPM39[OOPM],\">=\"&BM116,tbl_OPOVOON_P2OOPM39[Portion])>0.5,BM116,\"\"))","v":""},{"$f":"IF(COUNTIF(tbl_OPOVOON_P2OOPM39[OOPM],tbl_OPOVOON_P2OOPM39[[#This Row],[OOPM]])>1,\"Remove Duplicate Entry.\",IF(AND(tbl_OPOVOON_P2OOPM39[[#This Row],[OOPM]]<>\"\",tbl_OPOVOON_P2OOPM39[[#This Row],[Allowed Claims]]=0),\"Entry not found in Part 1 Table\",IF(AND(OFFSET(tbl_OPOVOON_P2OOPM39[[#This Row],[OOPM]],1,0)<>\"Total\",OFFSET(tbl_OPOVOON_P2OOPM39[[#This Row],[OOPM]],1,0)<>\"\",OFFSET(tbl_OPOVOON_P2OOPM39[[#This Row],[OOPM]],1,0)<tbl_OPOVOON_P2OOPM39[[#This Row],[OOPM]]),\"Sort Entries from lowest to highest\",\"\")))","v":""},null,null,null,null,null,{"$f":"SUMIF(tbl_OPAOOON_P140[Out-of-Pocket Maximum (OOPM)],BV116,tbl_OPAOOON_P140[Plan Projected Allowed Amount])","v":0},{"$f":"IF(OR(BW116=0,BW116=\"\"),\"\",BW116/tbl_OPAOOON_P2OOPM44[[#Totals],[Allowed Claims]])","v":""},{"$f":"IF(BX116=\"\",\"\",IF(SUMIF(tbl_OPAOOON_P2OOPM44[OOPM],\">=\"&BV116,tbl_OPAOOON_P2OOPM44[Portion])>0.5,BV116,\"\"))","v":""},{"$f":"IF(COUNTIF(tbl_OPAOOON_P2OOPM44[OOPM],tbl_OPAOOON_P2OOPM44[[#This Row],[OOPM]])>1,\"Remove Duplicate Entry.\",IF(AND(tbl_OPAOOON_P2OOPM44[[#This Row],[OOPM]]<>\"\",tbl_OPAOOON_P2OOPM44[[#This Row],[Allowed Claims]]=0),\"Entry not found in Part 1 Table\",IF(AND(OFFSET(tbl_OPAOOON_P2OOPM44[[#This Row],[OOPM]],1,0)<>\"Total\",OFFSET(tbl_OPAOOON_P2OOPM44[[#This Row],[OOPM]],1,0)<>\"\",OFFSET(tbl_OPAOOON_P2OOPM44[[#This Row],[OOPM]],1,0)<tbl_OPAOOON_P2OOPM44[[#This Row],[OOPM]]),\"Sort Entries from lowest to highest\",\"\")))","v":""},null,null,null,null,null,{"$f":"SUMIF(tbl_ER_P145[Out-of-Pocket Maximum (OOPM)],CE116,tbl_ER_P145[Plan Projected Allowed Amount])","v":0},{"$f":"IF(OR(CF116=0,CF116=\"\"),\"\",CF116/tbl_ER_P2OOPM48[[#Totals],[Allowed Claims]])","v":""},{"$f":"IF(CG116=\"\",\"\",IF(SUMIF(tbl_ER_P2OOPM48[OOPM],\">=\"&CE116,tbl_ER_P2OOPM48[Portion])>0.5,CE116,\"\"))","v":""},{"$f":"IF(COUNTIF(tbl_ER_P2OOPM48[OOPM],tbl_ER_P2OOPM48[[#This Row],[OOPM]])>1,\"Remove Duplicate Entry.\",IF(AND(tbl_ER_P2OOPM48[[#This Row],[OOPM]]<>\"\",tbl_ER_P2OOPM48[[#This Row],[Allowed Claims]]=0),\"Entry not found in Part 1 Table\",IF(AND(OFFSET(tbl_ER_P2OOPM48[[#This Row],[OOPM]],1,0)<>\"Total\",OFFSET(tbl_ER_P2OOPM48[[#This Row],[OOPM]],1,0)<>\"\",OFFSET(tbl_ER_P2OOPM48[[#This Row],[OOPM]],1,0)<tbl_ER_P2OOPM48[[#This Row],[OOPM]]),\"Sort Entries from lowest to highest\",\"\")))","v":""},null,null,null,null,null,{"$f":"SUMIF(tbl_RX_P149[Out-of-Pocket Maximum (OOPM)],CN116,tbl_RX_P149[Plan Projected Allowed Amount])","v":0},{"$f":"IF(OR(CO116=0,CO116=\"\"),\"\",CO116/tbl_RX_P2OOPM53[[#Totals],[Allowed Claims]])","v":""},{"$f":"IF(CP116=\"\",\"\",IF(SUMIF(tbl_RX_P2OOPM53[OOPM],\">=\"&CN116,tbl_RX_P2OOPM53[Portion])>0.5,CN116,\"\"))","v":""},{"$f":"IF(COUNTIF(tbl_RX_P2OOPM53[OOPM],tbl_RX_P2OOPM53[[#This Row],[OOPM]])>1,\"Remove Duplicate Entry.\",IF(AND(tbl_RX_P2OOPM53[[#This Row],[OOPM]]<>\"\",tbl_RX_P2OOPM53[[#This Row],[Allowed Claims]]=0),\"Entry not found in Part 1 Table\",IF(AND(OFFSET(tbl_RX_P2OOPM53[[#This Row],[OOPM]],1,0)<>\"Total\",OFFSET(tbl_RX_P2OOPM53[[#This Row],[OOPM]],1,0)<>\"\",OFFSET(tbl_RX_P2OOPM53[[#This Row],[OOPM]],1,0)<tbl_RX_P2OOPM53[[#This Row],[OOPM]]),\"Sort Entries from lowest to highest\",\"\")))","v":""}]
[null,null,null,null,null,null,null,null,null,null,8000,{"$f":"SUMIF(tbl_IPINN_P15[Out-of-Pocket Maximum (OOPM)],K117,tbl_IPINN_P15[Plan Projected Allowed Amount])","v":2285},{"$f":"IF(OR(L117=0,L117=\"\"),\"\",L117/tbl_IPINN_P2OOPM9[[#Totals],[Allowed Claims]])","v":0.5},{"$f":"IF(M117=\"\",\"\",IF(SUMIF(tbl_IPINN_P2OOPM9[OOPM],\">=\"&K117,tbl_IPINN_P2OOPM9[Portion])>0.5,K117,\"\"))","v":8000},{"$f":"IF(COUNTIF(tbl_IPINN_P2OOPM9[OOPM],tbl_IPINN_P2OOPM9[[#This Row],[OOPM]])>1,\"Remove Duplicate Entry.\",IF(AND(tbl_IPINN_P2OOPM9[[#This Row],[OOPM]]<>\"\",tbl_IPINN_P2OOPM9[[#This Row],[Allowed Claims]]=0),\"Entry not found in Part 1 Table\",IF(AND(OFFSET(tbl_IPINN_P2OOPM9[[#This Row],[OOPM]],1,0)<>\"Total\",OFFSET(tbl_IPINN_P2OOPM9[[#This Row],[OOPM]],1,0)<>\"\",OFFSET(tbl_IPINN_P2OOPM9[[#This Row],[OOPM]],1,0)<tbl_IPINN_P2OOPM9[[#This Row],[OOPM]]),\"Sort Entries from lowest to highest\",\"\")))","v":"Remove Duplicate Entry."},null,null,null,null,null,{"$f":"SUMIF(tbl_IPOON_P110[Out-of-Pocket Maximum (OOPM)],T117,tbl_IPOON_P110[Plan Projected Allowed Amount])","v":0},{"$f":"IF(OR(U117=0,U117=\"\"),\"\",U117/tbl_IPOON_P2OOPM14[[#Totals],[Allowed Claims]])","v":""},{"$f":"IF(V117=\"\",\"\",IF(SUMIF(tbl_IPOON_P2OOPM14[OOPM],\">=\"&T117,tbl_IPOON_P2OOPM14[Portion])>0.5,T117,\"\"))","v":""},{"$f":"IF(COUNTIF(tbl_IPOON_P2OOPM14[OOPM],tbl_IPOON_P2OOPM14[[#This Row],[OOPM]])>1,\"Remove Duplicate Entry.\",IF(AND(tbl_IPOON_P2OOPM14[[#This Row],[OOPM]]<>\"\",tbl_IPOON_P2OOPM14[[#This Row],[Allowed Claims]]=0),\"Entry not found in Part 1 Table\",IF(AND(OFFSET(tbl_IPOON_P2OOPM14[[#This Row],[OOPM]],1,0)<>\"Total\",OFFSET(tbl_IPOON_P2OOPM14[[#This Row],[OOPM]],1,0)<>\"\",OFFSET(tbl_IPOON_P2OOPM14[[#This Row],[OOPM]],1,0)<tbl_IPOON_P2OOPM14[[#This Row],[OOPM]]),\"Sort Entries from lowest to highest\",\"\")))","v":""},null,null,null,null,null,{"$f":"SUMIF(tbl_OPINN_P115[Out-of-Pocket Maximum (OOPM)],AC117,tbl_OPINN_P115[Plan Projected Allowed Amount])","v":0},{"$f":"IF(OR(AD117=0,AD117=\"\"),\"\",AD117/tbl_OPINN_P2OOPM19[[#Totals],[Allowed Claims]])","v":""},{"$f":"IF(AE117=\"\",\"\",IF(SUMIF(tbl_OPINN_P2OOPM19[OOPM],\">=\"&AC117,tbl_OPINN_P2OOPM19[Portion])>0.5,AC117,\"\"))","v":""},{"$f":"IF(COUNTIF(tbl_OPINN_P2OOPM19[OOPM],tbl_OPINN_P2OOPM19[[#This Row],[OOPM]])>1,\"Remove Duplicate Entry.\",IF(AND(tbl_OPINN_P2OOPM19[[#This Row],[OOPM]]<>\"\",tbl_OPINN_P2OOPM19[[#This Row],[Allowed Claims]]=0),\"Entry not found in Part 1 Table\",IF(AND(OFFSET(tbl_OPINN_P2OOPM19[[#This Row],[OOPM]],1,0)<>\"Total\",OFFSET(tbl_OPINN_P2OOPM19[[#This Row],[OOPM]],1,0)<>\"\",OFFSET(tbl_OPINN_P2OOPM19[[#This Row],[OOPM]],1,0)<tbl_OPINN_P2OOPM19[[#This Row],[OOPM]]),\"Sort Entries from lowest to highest\",\"\")))","v":""},null,null,null,null,null,{"$f":"SUMIF(tbl_OPOVINN_P120[Out-of-Pocket Maximum (OOPM)],AL117,tbl_OPOVINN_P120[Plan Projected Allowed Amount])","v":0},{"$f":"IF(OR(AM117=0,AM117=\"\"),\"\",AM117/tbl_OPOVINN_P2OOPM24[[#Totals],[Allowed Claims]])","v":""},{"$f":"IF(AN117=\"\",\"\",IF(SUMIF(tbl_OPOVINN_P2OOPM24[OOPM],\">=\"&AL117,tbl_OPOVINN_P2OOPM24[Portion])>0.5,AL117,\"\"))","v":""},{"$f":"IF(COUNTIF(tbl_OPOVINN_P2OOPM24[OOPM],tbl_OPOVINN_P2OOPM24[[#This Row],[OOPM]])>1,\"Remove Duplicate Entry.\",IF(AND(tbl_OPOVINN_P2OOPM24[[#This Row],[OOPM]]<>\"\",tbl_OPOVINN_P2OOPM24[[#This Row],[Allowed Claims]]=0),\"Entry not found in Part 1 Table\",IF(AND(OFFSET(tbl_OPOVINN_P2OOPM24[[#This Row],[OOPM]],1,0)<>\"Total\",OFFSET(tbl_OPOVINN_P2OOPM24[[#This Row],[OOPM]],1,0)<>\"\",OFFSET(tbl_OPOVINN_P2OOPM24[[#This Row],[OOPM]],1,0)<tbl_OPOVINN_P2OOPM24[[#This Row],[OOPM]]),\"Sort Entries from lowest to highest\",\"\")))","v":""},null,null,null,null,null,{"$f":"SUMIF(tbl_OPAOINN_P125[Out-of-Pocket Maximum (OOPM)],AU117,tbl_OPAOINN_P125[Plan Projected Allowed Amount])","v":0},{"$f":"IF(OR(AV117=0,AV117=\"\"),\"\",AV117/tbl_OPAOINN_P2OOPM29[[#Totals],[Allowed Claims]])","v":""},{"$f":"IF(AW117=\"\",\"\",IF(SUMIF(tbl_OPAOINN_P2OOPM29[OOPM],\">=\"&AU117,tbl_OPAOINN_P2OOPM29[Portion])>0.5,AU117,\"\"))","v":""},{"$f":"IF(COUNTIF(tbl_OPAOINN_P2OOPM29[OOPM],tbl_OPAOINN_P2OOPM29[[#This Row],[OOPM]])>1,\"Remove Duplicate Entry.\",IF(AND(tbl_OPAOINN_P2OOPM29[[#This Row],[OOPM]]<>\"\",tbl_OPAOINN_P2OOPM29[[#This Row],[Allowed Claims]]=0),\"Entry not found in Part 1 Table\",IF(AND(OFFSET(tbl_OPAOINN_P2OOPM29[[#This Row],[OOPM]],1,0)<>\"Total\",OFFSET(tbl_OPAOINN_P2OOPM29[[#This Row],[OOPM]],1,0)<>\"\",OFFSET(tbl_OPAOINN_P2OOPM29[[#This Row],[OOPM]],1,0)<tbl_OPAOINN_P2OOPM29[[#This Row],[OOPM]]),\"Sort Entries from lowest to highest\",\"\")))","v":""},null,null,null,null,null,{"$f":"SUMIF(tbl_OPOON_P130[Out-of-Pocket Maximum (OOPM)],BD117,tbl_OPOON_P130[Plan Projected Allowed Amount])","v":0},{"$f":"IF(OR(BE117=0,BE117=\"\"),\"\",BE117/tbl_OPOON_P2OOPM34[[#Totals],[Allowed Claims]])","v":""},{"$f":"IF(BF117=\"\",\"\",IF(SUMIF(tbl_OPOON_P2OOPM34[OOPM],\">=\"&BD117,tbl_OPOON_P2OOPM34[Portion])>0.5,BD117,\"\"))","v":""},{"$f":"IF(COUNTIF(tbl_OPOON_P2OOPM34[OOPM],tbl_OPOON_P2OOPM34[[#This Row],[OOPM]])>1,\"Remove Duplicate Entry.\",IF(AND(tbl_OPOON_P2OOPM34[[#This Row],[OOPM]]<>\"\",tbl_OPOON_P2OOPM34[[#This Row],[Allowed Claims]]=0),\"Entry not found in Part 1 Table\",IF(AND(OFFSET(tbl_OPOON_P2OOPM34[[#This Row],[OOPM]],1,0)<>\"Total\",OFFSET(tbl_OPOON_P2OOPM34[[#This Row],[OOPM]],1,0)<>\"\",OFFSET(tbl_OPOON_P2OOPM34[[#This Row],[OOPM]],1,0)<tbl_OPOON_P2OOPM34[[#This Row],[OOPM]]),\"Sort Entries from lowest to highest\",\"\")))","v":""},null,null,null,null,null,{"$f":"SUMIF(tbl_OPOVOON_P135[Out-of-Pocket Maximum (OOPM)],BM117,tbl_OPOVOON_P135[Plan Projected Allowed Amount])","v":0},{"$f":"IF(OR(BN117=0,BN117=\"\"),\"\",BN117/tbl_OPOVOON_P2OOPM39[[#Totals],[Allowed Claims]])","v":""},{"$f":"IF(BO117=\"\",\"\",IF(SUMIF(tbl_OPOVOON_P2OOPM39[OOPM],\">=\"&BM117,tbl_OPOVOON_P2OOPM39[Portion])>0.5,BM117,\"\"))","v":""},{"$f":"IF(COUNTIF(tbl_OPOVOON_P2OOPM39[OOPM],tbl_OPOVOON_P2OOPM39[[#This Row],[OOPM]])>1,\"Remove Duplicate Entry.\",IF(AND(tbl_OPOVOON_P2OOPM39[[#This Row],[OOPM]]<>\"\",tbl_OPOVOON_P2OOPM39[[#This Row],[Allowed Claims]]=0),\"Entry not found in Part 1 Table\",IF(AND(OFFSET(tbl_OPOVOON_P2OOPM39[[#This Row],[OOPM]],1,0)<>\"Total\",OFFSET(tbl_OPOVOON_P2OOPM39[[#This Row],[OOPM]],1,0)<>\"\",OFFSET(tbl_OPOVOON_P2OOPM39[[#This Row],[OOPM]],1,0)<tbl_OPOVOON_P2OOPM39[[#This Row],[OOPM]]),\"Sort Entries from lowest to highest\",\"\")))","v":""},null,null,null,null,null,{"$f":"SUMIF(tbl_OPAOOON_P140[Out-of-Pocket Maximum (OOPM)],BV117,tbl_OPAOOON_P140[Plan Projected Allowed Amount])","v":0},{"$f":"IF(OR(BW117=0,BW117=\"\"),\"\",BW117/tbl_OPAOOON_P2OOPM44[[#Totals],[Allowed Claims]])","v":""},{"$f":"IF(BX117=\"\",\"\",IF(SUMIF(tbl_OPAOOON_P2OOPM44[OOPM],\">=\"&BV117,tbl_OPAOOON_P2OOPM44[Portion])>0.5,BV117,\"\"))","v":""},{"$f":"IF(COUNTIF(tbl_OPAOOON_P2OOPM44[OOPM],tbl_OPAOOON_P2OOPM44[[#This Row],[OOPM]])>1,\"Remove Duplicate Entry.\",IF(AND(tbl_OPAOOON_P2OOPM44[[#This Row],[OOPM]]<>\"\",tbl_OPAOOON_P2OOPM44[[#This Row],[Allowed Claims]]=0),\"Entry not found in Part 1 Table\",IF(AND(OFFSET(tbl_OPAOOON_P2OOPM44[[#This Row],[OOPM]],1,0)<>\"Total\",OFFSET(tbl_OPAOOON_P2OOPM44[[#This Row],[OOPM]],1,0)<>\"\",OFFSET(tbl_OPAOOON_P2OOPM44[[#This Row],[OOPM]],1,0)<tbl_OPAOOON_P2OOPM44[[#This Row],[OOPM]]),\"Sort Entries from lowest to highest\",\"\")))","v":""},null,null,null,null,null,{"$f":"SUMIF(tbl_ER_P145[Out-of-Pocket Maximum (OOPM)],CE117,tbl_ER_P145[Plan Projected Allowed Amount])","v":0},{"$f":"IF(OR(CF117=0,CF117=\"\"),\"\",CF117/tbl_ER_P2OOPM48[[#Totals],[Allowed Claims]])","v":""},{"$f":"IF(CG117=\"\",\"\",IF(SUMIF(tbl_ER_P2OOPM48[OOPM],\">=\"&CE117,tbl_ER_P2OOPM48[Portion])>0.5,CE117,\"\"))","v":""},{"$f":"IF(COUNTIF(tbl_ER_P2OOPM48[OOPM],tbl_ER_P2OOPM48[[#This Row],[OOPM]])>1,\"Remove Duplicate Entry.\",IF(AND(tbl_ER_P2OOPM48[[#This Row],[OOPM]]<>\"\",tbl_ER_P2OOPM48[[#This Row],[Allowed Claims]]=0),\"Entry not found in Part 1 Table\",IF(AND(OFFSET(tbl_ER_P2OOPM48[[#This Row],[OOPM]],1,0)<>\"Total\",OFFSET(tbl_ER_P2OOPM48[[#This Row],[OOPM]],1,0)<>\"\",OFFSET(tbl_ER_P2OOPM48[[#This Row],[OOPM]],1,0)<tbl_ER_P2OOPM48[[#This Row],[OOPM]]),\"Sort Entries from lowest to highest\",\"\")))","v":""},null,null,null,null,null,{"$f":"SUMIF(tbl_RX_P149[Out-of-Pocket Maximum (OOPM)],CN117,tbl_RX_P149[Plan Projected Allowed Amount])","v":0},{"$f":"IF(OR(CO117=0,CO117=\"\"),\"\",CO117/tbl_RX_P2OOPM53[[#Totals],[Allowed Claims]])","v":""},{"$f":"IF(CP117=\"\",\"\",IF(SUMIF(tbl_RX_P2OOPM53[OOPM],\">=\"&CN117,tbl_RX_P2OOPM53[Portion])>0.5,CN117,\"\"))","v":""},{"$f":"IF(COUNTIF(tbl_RX_P2OOPM53[OOPM],tbl_RX_P2OOPM53[[#This Row],[OOPM]])>1,\"Remove Duplicate Entry.\",IF(AND(tbl_RX_P2OOPM53[[#This Row],[OOPM]]<>\"\",tbl_RX_P2OOPM53[[#This Row],[Allowed Claims]]=0),\"Entry not found in Part 1 Table\",IF(AND(OFFSET(tbl_RX_P2OOPM53[[#This Row],[OOPM]],1,0)<>\"Total\",OFFSET(tbl_RX_P2OOPM53[[#This Row],[OOPM]],1,0)<>\"\",OFFSET(tbl_RX_P2OOPM53[[#This Row],[OOPM]],1,0)<tbl_RX_P2OOPM53[[#This Row],[OOPM]]),\"Sort Entries from lowest to highest\",\"\")))","v":""}]
[null,null,null,null,null,null,null,null,null,null,null,{"$f":"SUMIF(tbl_IPINN_P15[Out-of-Pocket Maximum (OOPM)],K118,tbl_IPINN_P15[Plan Projected Allowed Amount])","v":0},{"$f":"IF(OR(L118=0,L118=\"\"),\"\",L118/tbl_IPINN_P2OOPM9[[#Totals],[Allowed Claims]])","v":""},{"$f":"IF(M118=\"\",\"\",IF(SUMIF(tbl_IPINN_P2OOPM9[OOPM],\">=\"&K118,tbl_IPINN_P2OOPM9[Portion])>0.5,K118,\"\"))","v":""},{"$f":"IF(COUNTIF(tbl_IPINN_P2OOPM9[OOPM],tbl_IPINN_P2OOPM9[[#This Row],[OOPM]])>1,\"Remove Duplicate Entry.\",IF(AND(tbl_IPINN_P2OOPM9[[#This Row],[OOPM]]<>\"\",tbl_IPINN_P2OOPM9[[#This Row],[Allowed Claims]]=0),\"Entry not found in Part 1 Table\",IF(AND(OFFSET(tbl_IPINN_P2OOPM9[[#This Row],[OOPM]],1,0)<>\"Total\",OFFSET(tbl_IPINN_P2OOPM9[[#This Row],[OOPM]],1,0)<>\"\",OFFSET(tbl_IPINN_P2OOPM9[[#This Row],[OOPM]],1,0)<tbl_IPINN_P2OOPM9[[#This Row],[OOPM]]),\"Sort Entries from lowest to highest\",\"\")))","v":""},null,null,null,null,"Total",{"$f":"SUBTOTAL(109,tbl_IPOON_P2OOPM14[Allowed Claims])","v":659},{"$f":"SUBTOTAL(109,tbl_IPOON_P2OOPM14[Portion])","v":1},null,{"$f":"IF(AND(tbl_IPOON_P2OOPM14[[#Totals],[Allowed Claims]]<U74,W74<>\"Fail\",W74<>\"N/A\"),\"Add missing cost share values.\",IF(U118>V57,\"Allowed claims higher than possible; correct entries.\",\"\"))","v":""},null,null,null,null,"Total",{"$f":"SUBTOTAL(109,tbl_OPINN_P2OOPM19[Allowed Claims])","v":0},{"$f":"SUBTOTAL(109,tbl_OPINN_P2OOPM19[Portion])","v":0},null,{"$f":"IF(AND(tbl_OPINN_P2OOPM19[[#Totals],[Allowed Claims]]<AD74,AF74<>\"Fail\",AF74<>\"N/A\"),\"Add missing cost share values.\",IF(AD118>AE55,\"Allowed claims higher than possible; correct entries.\",\"\"))","v":""},null,null,null,null,"Total",{"$f":"SUBTOTAL(109,tbl_OPOVINN_P2OOPM24[Allowed Claims])","v":0},{"$f":"SUBTOTAL(109,tbl_OPOVINN_P2OOPM24[Portion])","v":0},null,{"$f":"IF(AND(tbl_OPOVINN_P2OOPM24[[#Totals],[Allowed Claims]]<AM74,AO74<>\"Fail\",AO74<>\"N/A\"),\"Add missing cost share values.\",IF(AM118>AN55,\"Allowed claims higher than possible; correct entries.\",\"\"))","v":""},null,null,null,null,"Total",{"$f":"SUBTOTAL(109,tbl_OPAOINN_P2OOPM29[Allowed Claims])","v":0},{"$f":"SUBTOTAL(109,tbl_OPAOINN_P2OOPM29[Portion])","v":0},null,{"$f":"IF(AND(tbl_OPAOINN_P2OOPM29[[#Totals],[Allowed Claims]]<AV74,AX74<>\"Fail\",AX74<>\"N/A\"),\"Add missing cost share values.\",IF(AV118>AW55,\"Allowed claims higher than possible; correct entries.\",\"\"))","v":""},null,null,null,null,"Total",{"$f":"SUBTOTAL(109,tbl_OPOON_P2OOPM34[Allowed Claims])","v":0},{"$f":"SUBTOTAL(109,tbl_OPOON_P2OOPM34[Portion])","v":0},null,{"$f":"IF(AND(tbl_OPOON_P2OOPM34[[#Totals],[Allowed Claims]]<BE74,BG74<>\"Fail\",BG74<>\"N/A\"),\"Add missing cost share values.\",IF(BE118>BF55,\"Allowed claims higher than possible; correct entries.\",\"\"))","v":""},null,null,null,null,"Total",{"$f":"SUBTOTAL(109,tbl_OPOVOON_P2OOPM39[Allowed Claims])","v":0},{"$f":"SUBTOTAL(109,tbl_OPOVOON_P2OOPM39[Portion])","v":0},null,{"$f":"IF(AND(tbl_OPOVOON_P2OOPM39[[#Totals],[Allowed Claims]]<BN74,BP74<>\"Fail\",BP74<>\"N/A\"),\"Add missing cost share values.\",IF(BN118>BO55,\"Allowed claims higher than possible; correct entries.\",\"\"))","v":""},null,null,null,null,"Total",{"$f":"SUBTOTAL(109,tbl_OPAOOON_P2OOPM44[Allowed Claims])","v":0},{"$f":"SUBTOTAL(109,tbl_OPAOOON_P2OOPM44[Portion])","v":0},null,{"$f":"IF(AND(tbl_OPAOOON_P2OOPM44[[#Totals],[Allowed Claims]]<BW74,BY74<>\"Fail\",BY74<>\"N/A\"),\"Add missing cost share values.\",IF(BW118>BX55,\"Allowed claims higher than possible; correct entries.\",\"\"))","v":""},null,null,null,null,"Total",{"$f":"SUBTOTAL(109,tbl_ER_P2OOPM48[Allowed Claims])","v":0},{"$f":"SUBTOTAL(109,tbl_ER_P2OOPM48[Portion])","v":0},null,{"$f":"IF(AND(tbl_ER_P2OOPM48[[#Totals],[Allowed Claims]]<CF74,CH74<>\"Fail\",CH74<>\"N/A\"),\"Add missing cost share values.\",IF(CF118>CG55,\"Allowed claims higher than possible; correct entries.\",\"\"))","v":""},null,null,null,null,"Total",{"$f":"SUBTOTAL(109,tbl_RX_P2OOPM53[Allowed Claims])","v":0},{"$f":"SUBTOTAL(109,tbl_RX_P2OOPM53[Portion])","v":0},null,{"$f":"IF(AND(tbl_RX_P2OOPM53[[#Totals],[Allowed Claims]]<CO74,CQ74<>\"Fail\",CQ74<>\"N/A\"),\"Add missing cost share values.\",IF(CO118>CP55,\"Allowed claims higher than possible; correct entries.\",\"\"))","v":""}]
[null,null,null,null,null,null,null,null,null,null,"Total",{"$f":"SUBTOTAL(109,tbl_IPINN_P2OOPM9[Allowed Claims])","v":4570},{"$f":"SUBTOTAL(109,tbl_IPINN_P2OOPM9[Portion])","v":1},null,{"$f":"IF(AND(tbl_IPINN_P2OOPM9[[#Totals],[Allowed Claims]]<L74,N74<>\"Fail\",N74<>\"N/A\"),\"Add missing cost share values.\",IF(L119>M55,\"Allowed claims higher than possible; correct entries.\",\"\"))","v":"Allowed claims higher than possible; correct entries."}]